{"text_format":"1","workbook":"xlsx","n_sheets":12,"sheets":["Obrazac B2","Popis pokazatelja","AUTOHEIGHT","DATA_SHEET_TRAJ_UZORK","DATA_SHEET_NAC_ODR_PROT","META_DATA","DATA_SHEET_FREKV_UZORK","DATA_SHEET_VRSTA_OKNA","DATA_SHEET_VRSTE_PRIJAMNIKA","DATA_SHEET_VREMENSKI_UVJETI","DATA_SHEET_LABORATORIJI","DATA_SHEET_POKAZATELJI"],"not_rendered":{"charts":0,"images":0,"macros":1,"external_links":0,"defined_names":83,"comments":0,"pivot_tables":0},"unopened":[],"bounds":{"document_bytes":16777216,"sheet_cells":100000,"rows_first":2000,"rows_last":500,"rows_between":2000,"halvings":0,"cell_chars":16384,"cell_head_chars":4096},"cells_cut":0,"cells_raw":0,"read":"whole","date_system":"1900"}

{"sheet":"Obrazac B2","index":0,"n_rows":65,"n_cols":8,"rows_kept":65,"cut":false,"hidden":false,"merged":[[25,5,25,8],[24,5,24,8],[7,2,7,8],[7,0,7,1],[8,7,8,8],[11,7,11,8],[31,1,31,2],[34,1,34,4],[32,1,32,4],[32,5,32,8],[27,5,27,8],[27,1,27,4],[28,3,28,4],[28,1,28,2],[34,5,34,8],[33,1,33,4],[29,1,29,4],[30,1,30,4],[29,5,29,8],[30,5,30,8],[4,0,4,1],[3,2,3,8],[23,5,23,8],[10,0,10,1],[19,3,19,5],[20,3,20,5],[3,0,3,1],[15,6,17,6],[10,7,10,8],[13,3,13,5],[8,0,8,1],[13,1,13,2],[8,3,8,5],[9,3,9,5],[10,3,10,5],[5,3,5,5],[19,6,21,6],[15,3,15,5],[16,3,16,5],[22,0,22,8],[35,1,35,4],[46,2,46,3],[5,7,5,8],[64,6,64,8],[63,0,63,2],[63,6,63,8],[48,2,48,3],[51,2,51,3],[51,6,51,8],[55,2,55,3],[55,6,55,8],[62,6,62,8],[49,2,49,3],[64,0,64,2],[62,0,62,2],[48,6,48,8],[50,6,50,8],[49,6,49,8],[11,3,11,5],[26,1,26,4],[26,5,26,8],[28,6,28,7],[25,1,25,4],[24,1,24,4],[40,1,40,2],[38,5,38,8],[39,5,39,8],[40,3,40,4],[40,6,40,7],[38,1,38,4],[53,6,53,8],[43,2,43,3],[44,2,44,3],[45,2,45,3],[44,6,44,8],[43,6,43,8],[52,2,52,3],[53,2,53,3],[50,2,50,3],[52,6,52,8],[47,2,47,3],[45,6,45,8],[46,6,46,8],[47,6,47,8],[36,1,36,4],[37,1,37,4],[36,5,36,8],[37,5,37,8],[0,0,0,8],[62,3,62,5],[41,0,41,8],[42,6,42,8],[33,5,33,8],[59,0,60,8],[31,3,31,4],[31,6,31,7],[1,3,1,4],[4,3,4,5],[15,0,15,1],[23,1,23,4],[19,0,19,1],[20,0,20,1],[1,7,1,8],[4,7,4,8],[35,5,35,8],[39,1,39,4],[54,0,54,8],[42,2,42,3]]}
["Obrazac B2 - OČEVIDNIK ISPITIVANJA KOMPOZITNOG UZORKA"]
[null,null,"Naš broj:",null,null,null,"Datum:"]
[]
["Naziv onečišćivača:"]
["Adresa sjedišta:",null,"Ulica i kućni br.:",null,null,null,"OIB:"]
[null,null,"Naselje:",null,null,null,"MBPS (DZS):"]
[]
["Naziv lokacije onečišćivača:"]
["Adresa lokacije:",null,"Ulica i kućni br.:",null,null,null,"RBDPS (DZS):"]
[null,null,"Naselje:"]
["Kontakt osoba na lokaciji: ",null,"Ime i prezime:",null,null,null,"Tel:"]
[null,null,"e-mail:",null,null,null,"Mob:"]
[]
[null,"Vrsta prijamnika:"]
[]
["Podaci o ispustu:",null,"Naziv ispusta:",null,null,null,"Koordinate točke  ispuštanja (HTRS96/TM):","N    "]
[null,null,"Oznaka ispusta:",null,null,null,null,"E    "]
[]
[]
["Podaci o mjernom oknu:",null,"Vrsta mj. okna:",null,null,null,"Koordinate   mjernog okna (HTRS96/TM):","N    "]
[null,null,"ID mj. okna:",null,null,null,null,"E    "]
[]
["OPĆI PODACI "]
[1,"Podaci o laboratoriju koji je izvršio ispitivanje otpadne vode"]
[2,"Analitički broj izvješća o ispitivanju"]
[3,"Datum izvješća o ispitivanju (dd.mm.gggg)"]
[4,"Podaci o laboratoriju koji je izvršio uzorkovanje"]
[5,"Naziv i oznaka uzorka"]
[6,"Početak uzorkovanja ",null,"Datum  (dd.mm.gggg)",null,null,"Vrijeme (hh:min)"]
[7,"Trajanje uzorkovanja (h)"]
[8,"Frekvencija uzorkovanja (h)"]
[9,"Dostava uzorka na ispitivanje",null,"Datum  (dd.mm.gggg)",null,null,"Vrijeme (hh:min)"]
[10,"Vremenski uvjeti tijekom uzorkovanja"]
[11,"Vremenski uvjeti prethodni dan"]
[12,"Prosječna temperatura zraka za vrijeme uzorkovanja (°C)"]
[13,"Trajanje ispuštanja otpadnih voda (h/dan)"]
[14,"Srednji protok tijekom uzorkovanja otpadnih voda  (l/sek)"]
[15,"Maksimalni protok tijekom uzorkovanja otpadnih voda  (l/sek)"]
[16,"Minimalni protok tijekom uzorkovanja otpadnih voda  (l/sek)"]
[17,"Način utvrđivanja protoka otpadnih voda u trenutku uzorkovanja"]
[18,"Trajanje ispitivanja (dd.mm.gggg)",null,"Početak ispitivanja",null,null,"Završetak ispitivanja"]
["REZULTATI ISPITIVANJA OTPADNIH VODA"]
["Red.br.","Šifra pokazatelja","Pokazatelj",null,"Mjerna jedinica","Rezultat","Metoda"]
[1,"FKP0011-0001","pH vrijednost",null," -",""]
[2,"FKP0023-0001","Temperatura vode",null,"°C",""]
[3,"FKP0003-0001","Boja",null," -"]
[4,"FKP0006-0001","Miris",null," -"]
[5,"FKP0005-0001","Krupne tvari",null," -"]
[6,"FKP0018-0002","Suhi ostatak ukupni 105°C ",null,"mg/l",""]
[7,"FKP0022-0001","Taložive tvari",null,"ml/lh"]
[8,"FKP0020-0001","Ukupne suspendirane tvari ",null,"mg/l",""]
[9,"REK0004-0002","Otopljeni kisik ",null,"mgO2/l"]
[10,"REK0001-0001","BPK5",null,"mgO2/l"]
[11,"REK0002-0001","KPKCr ",null,"mgO2/l"]
["Ostali pokazatelji koji su ispitani"]
[{"$f":"ROW()-44","v":12},{"$f":"IFERROR(VLOOKUP(C56,Pokazatelji,3,FALSE),\"\")","v":""},null,null,{"$f":"IFERROR(VLOOKUP(C56,Pokazatelji,4,FALSE),\"\")","v":""},null,""]
[]
[]
[]
["Pod materijalnom i kaznenom odgovornošću izjavljujem da su podaci u ovom očevidniku vjerodostojni, istiniti i istovjetni dostavljenim podacima."]
[]
[]
[null,null,null,"M.P.",null,null,"Odgovorna osoba onečišćivača"]
[]
[null,null,null,null,null,null,"ime i prezime"]

{"sheet":"Popis pokazatelja","index":1,"n_rows":326,"n_cols":3,"rows_kept":326,"cut":false,"hidden":false,"merged":[]}
["Datum ispisa:",{"$f":"TODAY()","v":"2026-02-19"}]
["Šifra pokazatelja","Naziv pokazatelja","Mjerna jedinica"]
[{"$f":"_xlfn._xlws.SORT(\n    _xlfn._xlws.FILTER(\n        CHOOSE({1,2,3},\n            DATA_SHEET_POKAZATELJI!C2:C1000,\n            DATA_SHEET_POKAZATELJI!A2:A1000,\n            DATA_SHEET_POKAZATELJI!D2:D1000\n        ),\n        DATA_SHEET_POKAZATELJI!A2:A1000<>\"\"\n    ),\n    2,\n    1\n)","v":"ORG0001-0002"},"1,1,1-trikloretan","mg/l"]
["ORG0002-0001","1,1-dikloreten","mg/l"]
["ORG0003-0001","1,2,3,4,6,7,8,9-Oktaklordibenzodioksin (OCDD) ","ng/l"]
["ORG0004-0001","1,2,3,4,6,7,8,9-Oktaklordibenzofuran (OCDF) ","ng/l"]
["ORG0005-0001","1,2,3,4,6,7,8-Heptaklordibenzodioksin (HpCDD) ","ng/l"]
["ORG0006-0001","1,2,3,4,6,7,8-Heptaklordibenzofuran (HpCDF) ","ng/l"]
["ORG0007-0001","1,2,3,4,7,8,9-Heptaklordibenzofuran (HpCDF) ","ng/l"]
["ORG0008-0001","1,2,3,4,7,8-Heksaklordibenzodioksin (HxCDD)","ng/l"]
["ORG0009-0001","1,2,3,4,7,8-Heksaklordibenzofuran (HxCDF) ","ng/l"]
["ORG0010-0001","1,2,3,6,7,8-Heksaklordibenzodioksin (HxCDD) ","ng/l"]
["ORG0011-0001","1,2,3,6,7,8-Heksaklordibenzofuran (HxCDF) ","ng/l"]
["ORG0012-0001","1,2,3,7,8,9-Heksaklordibenzodioksin (HxCDD)","ng/l"]
["ORG0013-0001","1,2,3,7,8,9-Heksaklordibenzofuran (HxCDF) ","ng/l"]
["ORG0014-0001","1,2,3,7,8-Pentaklordibenzodioksin (PeCDD)","ng/l"]
["ORG0015-0001","1,2,3,7,8-Pentaklordibenzofuran (PeCDF)","ng/l"]
["ORG0016-0002","1,2,3-triklorbenzen","mg/l"]
["ORG0017-0002","1,2,4-triklorbenzen","mg/l"]
["ORG0018-0002","1,2,5,6,9,10-heksabromociklododekan","mg/l"]
["ORG0019-0002","1,2-dikloretan","mg/l"]
["ORG0020-0002","1,3,5,7,9,11-heksabromociklododekan ","mg/l"]
["ORG0021-0002","1,3,5-triklorbenzen","mg/l"]
["ORG0022-0001","2,3,4,6,7,8-Heksaklordibenzofuran (HxCDF) ","ng/l"]
["ORG0023-0001","2,3,4,7,8-Pentaklordibenzofuran (PeCDF) ","ng/l"]
["ORG0024-0001","2,3,7,8-Tetraklordibenzodioksin (TCDD)","ng/l"]
["ORG0025-0001","2,3,7,8-Tetraklordibenzofuran (TCDF)","ng/l"]
["ORG0417-0001","2,4' DDD","mg/l"]
["ORG0418-0001","2,4' DDE","mg/l"]
["ORG0026-0002","2,4' DDT","mg/l"]
["ORG0032-0002","4,4' DDD","mg/l"]
["ORG0033-0002","4,4' DDE","mg/l"]
["ORG0034-0002","4,4' DDT","mg/l"]
["ORG0419-0001","4:2 Fluorotelomer sulfonska kiselina (4:2 FTS)","µg/l"]
["ORG0035-0003","4-nonilfenol","mg/l"]
["ORG0407-0001","4-nonilfenol dietoksilat","mg/l"]
["ORG0031-0003","4-tert-oktilfenol","mg/l"]
["ORG0408-0001","4-tert-oktilfenol dietoksilat","mg/l"]
["ORG0420-0001","6:2 Fluorotelomer sulfonska kiselina (6:2 FTS)","µg/l"]
["ORG0421-0001","8:2 Fluorotelomer sulfonska kiselina (8:2 FTS)","µg/l"]
["ORG0409-0001","Acenaften","mg/l"]
["ORG0410-0001","Acenaftilen","mg/l"]
["ORG0039-0002","Adsorbilni organski halogeni (AOX)","mg/l"]
["ORG0040-0002","Aklonifen","mg/l"]
["ORG0042-0001","Akrilonitril","mg/l"]
["ORG0043-0002","Alaklor","mg/l"]
["ORG0044-0002","Aldrin","mg/l"]
["MET0001-0003","Aluminij ukupni","mg/l"]
["ORG0310-0001","Amoksicilin","µg/l"]
["HRT0001-0001","Amonij","mgN/l"]
["HRT0002-0001","Anorganski dušik","mgN/l"]
["MET0002-0002","Antimon otopljeni","mg/l"]
["MET0002-0004","Antimon ukupni","mg/l"]
["ORG0047-0002","Antracen","mg/l"]
["MET0003-0002","Arsen otopljeni","mg/l"]
["MET0003-0004","Arsen ukupni","mg/l"]
["ORG0048-0002","Atrazin","mg/l"]
["ORG0049-0001","Azbest","mg/l"]
["ORG0050-0002","Azinfos (-etil)","mg/l"]
["ORG0051-0002","Azinfos (-metil)","mg/l"]
["ORG0052-0002","Azitromicin","mg/l"]
["ORG0052-0002","Azitromicin","mg/l"]
["ORG0311-0001","Azitromicin-N-dezmetilazitromicin","µg/l"]
["ORG0311-0001","Azitromicin-N-dezmetilazitromicin","µg/l"]
["MET0004-0002","Bakar otopljeni","mg/l"]
["MET0004-0004","Bakar ukupni","mg/l"]
["MET0005-0002","Barij otopljeni","mg/l"]
["MET0005-0004","Barij ukupni","mg/l"]
["ORG0054-0002","Benzen","mg/l"]
["ORG0411-0001","Benzo(a)antracen","mg/l"]
["ORG0055-0002","Benzo(a)piren","mg/l"]
["ORG0056-0002","Benzo(b)fluoranten","mg/l"]
["ORG0057-0002","Benzo(g,h,i)perilen","mg/l"]
["ORG0058-0002","Benzo(k)fluoranten","mg/l"]
["MET0006-0002","Berilij otopljeni","mg/l"]
["MET0006-0004","Berilij ukupni","mg/l"]
["ORG0060-0002","Bifenoks","mg/l"]
["EKO0001-0001","Biološka razgradljivost OOU","nema"]
["MET0007-0002","Bor otopljeni","mg/l"]
["MET0007-0004","Bor ukupni","mg/l"]
["TER0001-0001","BPK5 teret","kg/t proizv/sirovine"]
["MBP0003-0001","Broj fekalnih koliforma","broj/100 ml"]
["MBP0004-0001","Broj fekalnih streptokoka","broj/100 ml"]
["ORG0064-0002","Bromdiklormetan","mg/l"]
["ORG0065-0002","Bromoform","mg/l"]
["ORG0068-0002","C₁₀₋₁₃ kloralkani","mg/l"]
["ORG0070-0002","Cibutrin","mg/l"]
["ION0003-0001","Cijanidi otopljeni","mg/l"]
["ION0003-0002","Cijanidi slobodni","mg/l"]
["ION0003-0004","Cijanidi ukupni","mg/l"]
["MET0008-0002","Cink otopljeni","mg/l"]
["MET0008-0004","Cink ukupni","mg/l"]
["ORG0071-0002","Cipermetrin","mg/l"]
["ORG0312-0001","Ciprofloksacin","µg/l"]
["MBP0008-0001","Crijevni enterokoki","broj/100 ml"]
["ORG0075-0003","DDT ukupni ","mg/l"]
["ORG0080-0002","Detergenti anionski","mg/l"]
["ORG0081-0001","Detergenti kationski ","mg/l"]
["ORG0082-0002","Detergenti neionski","mg/l"]
["ORG0083-0001","Detergenti, zbroj anionskih i neionskih","mg/l"]
["ORG0084-0002","Di(2-etilheksil)ftalat) (DEHP)","mg/l"]
["ORG0412-0001","Dibenzo(a,h)antracen","mg/l"]
["ORG0086-0002","Dibromklormetan","mg/l"]
["ORG0087-0002","Dieldrin","mg/l"]
["ORG0092-0001","Diklorbenzen","mg/l"]
["ORG0093-0002","Diklormetan","mg/l"]
["ORG0094-0002","Diklorvos","mg/l"]
["ORG0095-0002","Dikofol","mg/l"]
["ORG0098-0001","Dioksini i furani","ng/l"]
["ORG0100-0002","Diuron","mg/l"]
["EKO0002-0001","Ekotoksičnost na dafnije LIDD","faktor razrjeđenja"]
["EKO0002-0002","Ekotoksičnost na morske alge LIDA","faktor razrjeđenja"]
["EKO0002-0003","Ekotoksičnost na svjetleće bakterije LIDL","faktor razrjeđenja"]
["FKP0004-0002","Električna vodljivost pri 25°C","µS/cm"]
["ORG0101-0003","Endosulfan ukupni","mg/l"]
["ORG0102-0002","Endrin","mg/l"]
["ORG0105-0002","Eritromicin","mg/l"]
["ORG0105-0002","Eritromicin","mg/l"]
["MBP0010-0001","Escherichia coli ","broj/100 ml"]
["ORG0108-0001","Etilbenzen ","mg/l"]
["ORG0413-0001","Fenantren","mg/l"]
["ORG0114-0002","Fenitrotion","mg/l"]
["ORG0116-0002","Fenoli ukupni","mg/l"]
["ORG0117-0002","Fention","mg/l"]
["ORG0121-0002","Fluoranten","mg/l"]
["ORG0414-0001","Fluoren","mg/l"]
["ION0004-0001","Fluoridi","mg/l"]
["ORG0126-0001","Formalaldehid","mg/l"]
["EKO0003-0001","Genotoksičnost LIDEU","faktor razrjeđenja"]
["ORG0131-0001","Heksabromobifenil","mg/l"]
["ORG0132-0001","Heksabromociklododekan (HBCDD)","mg/l"]
["ORG0134-0002","Heksaklorbenzen (HCB)","mg/l"]
["ORG0135-0002","Heksaklorbutadien","mg/l"]
["ORG0136-0002","Heksaklorcikloheksan ukupni (HCH)","mg/l"]
["ORG0137-0002","Heptaklor","mg/l"]
["ORG0138-0002","Heptaklorepoksid","mg/l"]
["ORG0141-0002","Indeno(1,2,3-cd)piren","mg/l"]
["ORG0142-0002","Izodrin","mg/l"]
["ORG0144-0002","Izoproturon","mg/l"]
["MET0009-0002","Kadmij otopljeni","mg/l"]
["MET0009-0004","Kadmij ukupni","mg/l"]
["HRT0003-0001","Kjeldahl dušik","mgN/l"]
["ORG0147-0001","Klaritromicin","µg/l"]
["ORG0147-0001","Klaritromicin","µg/l"]
["ION0015-0003","Klor slobodni","mg/l"]
["ION0016-0003","Klor ukupni","mg/l"]
["ORG0150-0002","Klorfenvinfos","mg/l"]
["ION0009-0001","Kloridi","mg/l"]
["ORG0152-0002","Klorpirifos (-etil)","mg/l"]
["MET0010-0002","Kobalt otopljeni","mg/l"]
["MET0010-0004","Kobalt ukupni","mg/l"]
["MET0011-0002","Kositar otopljeni","mg/l"]
["MET0011-0004","Kositar ukupni","mg/l"]
["TER0001-0002","KPKCr teret","kg/t proizv/sirovine"]
["REK0003-0001","KPK-Mn","mgO₂/l"]
["ORG0415-0001","Krizen","mg/l"]
["MET0013-0001","Krom 3+","mg/l"]
["MET0014-0001","Krom 6+","mg/l"]
["MET0012-0002","Krom otopljeni","mg/l"]
["MET0012-0004","Krom ukupni","mg/l"]
["ORG0156-0002","Ksilen ukupni","mg/l"]
["ORG0158-0002","Kvinoksifen","mg/l"]
["ORG0159-0001","Lakohlapljivi aromatski ugljikovodici (BTEX)","mg/l"]
["ORG0294-0002","Lakohlapljivi klorirani ugljikovodici (LHKU)","mg/l"]
["ORG0347-0001","Levotiroksin natrij hidrat","µg/l"]
["ORG0347-0001","Levotiroksin natrij hidrat","µg/l"]
["MET0015-0002","Litij otopljeni","mg/l"]
["MET0015-0003","Litij ukupni","mg/l"]
["ION0012-0001","Magnezij","mg/l"]
["ORG0161-0002","Malation","mg/l"]
["MET0016-0002","Mangan otopljeni","mg/l"]
["MET0016-0004","Mangan ukupni","mg/l"]
["ORG0313-0001","Memantin","µg/l"]
["ORG0313-0001","Memantin","µg/l"]
["ORG0346-0001","Metionin, DL-","µg/l"]
["ORG0346-0001","Metionin, DL-","µg/l"]
["ORG0171-0002","Metoksiklor","mg/l"]
["ORG0178-0002","m-ksilen","mg/l"]
["ORG0179-0002","m-ksilen+p-ksilen","mg/l"]
["MET0017-0002","Molibden otopljeni","mg/l"]
["MET0017-0003","Molibden ukupni","mg/l"]
["FKP0007-0001","Mulj","nema"]
["ORG0180-0002","Naftalen","mg/l"]
["ION0013-0001","Natrij","mg/l"]
["MET0018-0002","Nikal otopljeni","mg/l"]
["MET0018-0004","Nikal ukupni","mg/l"]
["HRT0005-0001","Nitrati","mgN/l"]
["HRT0006-0002","Nitriti","mgN/l"]
["ORG0182-0001","N-nitrozodibutilamin","mg/l"]
["ORG0183-0002","Nonilfenol","mg/l"]
["ORG0183-0004","Nonilfenol i etoksilati (NP/NPE), smjesa izomera","mg/l"]
["ORG0187-0002","o-ksilen","mg/l"]
["ORG0188-0001","Oksitetraciklin hidroklorid","mg/l"]
["ORG0188-0001","Oksitetraciklin hidroklorid","mg/l"]
["ORG0190-0001","Oktilfenoli i oktilfenol etoksilati   ","mg/l"]
["MET0019-0002","Olovo otopljeno","mg/l"]
["MET0019-0004","Olovo ukupno","mg/l"]
["ORG0192-0002","Organofosforni pesticidi ukupni","mg/l"]
["ORG0193-0002","Organoklorovi pesticidi ukupni","mg/l"]
["HRT0007-0001","Organski dušik","mgN/l"]
["HRT0008-0001","Ortofosfati otopljeni","mgP/l"]
["HRT0009-0001","Otopljeni organski ugljik (DOC)","mgC/l"]
["ORG0194-0002","Paration","mg/l"]
["ORG0195-0002","Paration (-metil)","mg/l"]
["ORG0196-0002","PBDE 100","mg/l"]
["ORG0197-0002","PBDE 153","mg/l"]
["ORG0198-0002","PBDE 154","mg/l"]
["ORG0199-0001","PBDE 183","µg/l"]
["ORG0200-0002","PBDE 28","mg/l"]
["ORG0201-0002","PBDE 47","mg/l"]
["ORG0202-0002","PBDE 99","mg/l"]
["ORG0203-0002","PCB 101","mg/l"]
["ORG0204-0002","PCB 105","mg/l"]
["ORG0205-0002","PCB 114","mg/l"]
["ORG0206-0002","PCB 118","mg/l"]
["ORG0207-0002","PCB 123","mg/l"]
["ORG0208-0002","PCB 126","mg/l"]
["ORG0209-0002","PCB 138","mg/l"]
["ORG0210-0002","PCB 153","mg/l"]
["ORG0211-0002","PCB 156","mg/l"]
["ORG0212-0002","PCB 157","mg/l"]
["ORG0213-0002","PCB 167","mg/l"]
["ORG0214-0002","PCB 169","mg/l"]
["ORG0215-0002","PCB 180","mg/l"]
["ORG0216-0002","PCB 189","mg/l"]
["ORG0217-0001","PCB 194","mg/l"]
["ORG0218-0002","PCB 28","mg/l"]
["ORG0219-0002","PCB 52","mg/l"]
["ORG0220-0002","PCB 77","mg/l"]
["ORG0221-0002","PCB 81","mg/l"]
["ORG0224-0002","Pentaklorbenzen","mg/l"]
["ORG0225-0002","Pentaklorfenol","mg/l"]
["ORG0381-0001","Perfluorobutan sulfonska kiselina (PFBS)","µg/l"]
["ORG0371-0001","Perfluorobutanska kiselina (PFBA)","µg/l"]
["ORG0377-0001","Perfluorodekanska kiselina (PFDA)","µg/l"]
["ORG0383-0001","Perfluoroheksan sulfonska kiselina (PFHxS)","µg/l"]
["ORG0373-0001","Perfluoroheksanska kiselina (PFHxA)","µg/l"]
["ORG0384-0001","Perfluoroheptan sulfonska kiselina (PFHpS)","µg/l"]
["ORG0374-0001","Perfluoroheptanska kiselina (PFHpA)","µg/l"]
["ORG0226-0001","Perfluoroktansulfonska kiselina i derivati (PFOS)","µg/l"]
["ORG0385-0001","Perfluorononan sulfonska kiselina (PFNS)","µg/l"]
["ORG0376-0001","Perfluorononanska kiselina (PFNA)","µg/l"]
["ORG0375-0001","Perfluorooktanska kiselina (PFOA)","µg/l"]
["ORG0382-0001","Perfluoropentan sulfonska kiselina (PFPeS)","µg/l"]
["ORG0372-0001","Perfluoropentanska kiselina (PFPeA)","µg/l"]
["ORG0229-0001","Pesticidi-staro","mg/l"]
["ORG0348-0001","Pimobendan","µg/l"]
["ORG0348-0001","Pimobendan","µg/l"]
["ORG0416-0001","Piren","mg/l"]
["ORG0235-0002","p-ksilen","mg/l"]
["ORG0236-0002","Polibromirani difenileteri (PBDE)","mg/l"]
["ORG0237-0002","Policiklički aromatski ugljikovodici (PAH)","mg/l"]
["ORG0238-0002","Poliklorirani bifenili ukupni (PCB)","mg/l"]
["RAD0001-0001","Radioaktivnost alfa ukupna","mBq/l"]
["RAD0002-0001","Radioaktivnost beta ukupna","mBq/l"]
["RAD0003-0001","Radioaktivnost gama ukupna","mBq/l"]
["MET0020-0002","Selen otopljeni","mg/l"]
["MET0020-0004","Selen ukupni","mg/l"]
["ORG0242-0002","Simazin","mg/l"]
["MET0021-0002","Srebro otopljeno","mg/l"]
["MET0021-0004","Srebro ukupno","mg/l"]
["ORG0244-0002","Stiren","mg/l"]
["MET0022-0002","Stroncij otopljeni","mg/l"]
["MET0022-0003","Stroncij ukupni","mg/l"]
["FKP0019-0002","Suhi ostatak žareni 600°C","mg/l"]
["ORG0253-0001","Sulfametoksazol","µg/l"]
["ORG0253-0001","Sulfametoksazol","µg/l"]
["ION0018-0001","Sulfati","mg/l"]
["ION0019-0001","Sulfidi","mg/l"]
["ION0020-0001","Sulfiti","mg/l"]
["FKP0021-0001","Suspendirane tvari žarene","mg/l"]
["MET0023-0002","Talij otopljeni","mg/l"]
["MET0023-0003","Talij ukupni","mg/l"]
["MET0024-0002","Telur otopljeni","mg/l"]
["MET0024-0003","Telur ukupni","mg/l"]
["FKP0023-0002","Temperatura vode - bioreaktor","°C"]
["ORG0264-0002","Terbutrin","mg/l"]
["ORG0291-0001","Teškohlapljive lipofilne tvari","mg/l"]
["ORG0266-0003","Tetrakloretilen","mg/l"]
["ORG0267-0002","Tetraklormetan (tetraklorugljik)","mg/l"]
["MET0025-0001","Titanij otopljeni","mg/l"]
["MET0025-0002","Titanij ukupni","mg/l"]
["ORG0276-0002","Toluen","mg/l"]
["ORG0277-0001","Torasemid","µg/l"]
["ORG0277-0001","Torasemid","µg/l"]
["ORG0282-0002","Tributilkositrovi spojevi","mg/l"]
["ORG0283-0001","Trifenilkositrovi spojevi","mg/l"]
["ORG0284-0002","Trifluralin","mg/l"]
["ORG0286-0002","Triklorbenzen (svi izomeri)","mg/l"]
["ORG0287-0003","Trikloretilen","mg/l"]
["ORG0289-0002","Triklormetan (kloroform)","mg/l"]
["ORG0336-0001","Trimetoprim","µg/l"]
["ORG0336-0001","Trimetoprim","µg/l"]
["TER0001-0003","uk.susp.tvar teret","kg/t proizv/sirovine"]
["FKP0030-0001","Ukupne otopljene tvari","mg/l"]
["ORG0292-0001","Ukupne površinski aktivne tvari","mg/l"]
["ORG0293-0001","Ukupni aromatski ugljikovodici ","mg/l"]
["MBP0016-0001","Ukupni broj koliformnih bakterija","broj/100 ml"]
["HRT0010-0002","Ukupni dušik","mgN/l"]
["HRT0011-0001","Ukupni fosfor","mgP/l"]
["ORG0309-0001","Ukupni halogenirani ugljikovodici ","mg/l"]
["ORG0295-0001","Ukupni nitrirani ugljikovodici ","mg/l"]
["HRT0012-0001","Ukupni organski ugljik (TOC)","mgC/l"]
["ORG0177-0003","Ukupni ugljikovodici C10-C40","mg/l"]
["MET0026-0001","Uranij otopljeni","mg/l"]
["MET0026-0002","Uranij ukupni","mg/l"]
["MET0027-0002","Vanadij otopljeni","mg/l"]
["MET0027-0004","Vanadij ukupni","mg/l"]
["ORG0315-0001","Varfarin","µg/l"]
["ORG0315-0001","Varfarin","µg/l"]
["ORG0296-0002","Vinil klorid","mg/l"]
["MET0028-0002","Željezo otopljeno","mg/l"]
["MET0028-0004","Željezo ukupno","mg/l"]
["MET0030-0002","Živa otopljena","mg/l"]
["MET0030-0004","Živa ukupna","mg/l"]
["ORG0299-0002","α-endosulfan","mg/l"]
["ORG0300-0002","α-heksabromociklododekan","mg/l"]
["ORG0301-0002","α-heksaklorcikloheksan (HCH)","mg/l"]
["ORG0302-0003","β-endosulfan","mg/l"]
["ORG0303-0002","β-heksabromociklododekan ","mg/l"]
["ORG0304-0002","β-Heksaklorcikloheksan (HCH)","mg/l"]
["ORG0305-0001","γ-heksabromociklododekan","mg/l"]
["ORG0307-0002","γ-Heksaklorcikloheksan (HCH) - Lindan","mg/l"]
["FKP0036-0001","Δ TP","°C"]
["FKP0036-0002","Δ TR","°C"]
["ORG0308-0002","δ-Heksaklorcikloheksan (HCH)","mg/l"]

{"sheet":"AUTOHEIGHT","index":2,"n_rows":0,"n_cols":0,"rows_kept":0,"cut":false,"hidden":true,"merged":[]}

{"sheet":"DATA_SHEET_TRAJ_UZORK","index":3,"n_rows":7,"n_cols":2,"rows_kept":7,"cut":false,"hidden":true,"merged":[]}
["Vrijeme","IDPeriodUzorkovanja"]
[4,4]
[6,5]
[8,6]
[12,7]
[16,8]
[24,9]

{"sheet":"DATA_SHEET_NAC_ODR_PROT","index":4,"n_rows":3,"n_cols":2,"rows_kept":3,"cut":false,"hidden":true,"merged":[]}
["Naziv","IDNacinOdredivanjaProtoka"]
["Ugrađeni mjerni uređaj",1]
["Uređaj laboratorija",2]

{"sheet":"META_DATA","index":5,"n_rows":12,"n_cols":2,"rows_kept":12,"cut":false,"hidden":true,"merged":[]}
["TYPE","B2"]
["VERSION","2.2"]
["DATE","19.02.2026."]
["DESCRIPTION","1.0: Inicijalna verzija\n1.1: Dorade za specifikaciju v5.0\n1.2: BugFixes \n1.3: BugFixes\n1.4: Dodani pokazatelji \n1.6 Azuriranje naziva laboratorija zavoda Osijek\n1.7 dodani pokazatelji\n1.8 dodan laboratorij ZAVOD ZA JAVNO ZDRAVSTVO ZAGREBAČKE ŽUPANIJE\n1.9 dodan pokazatelj FKP0030-0001FKP0030-0001\n2.1 dodani pokazatelji, dodan sheet Popis pokazatelja\n2.2 promjenjen naziv laboratorija Istra, dodan novi laboratorij"]
["DATA_SHEET_VREMENSKI_UVJETI","exec [ZastitaVoda].[VrijemenskiUvjetiGetForOtpadneVode]"]
["DATA_SHEET_LABORATORIJI","select lab.NazivLaboratorijaOtpadneVode, lab.IDLaboratorij, nas.Naziv as Naselje, adr.Ulica from ZastitaVoda.Laboratorij as lab inner join Adresa.Adresa as adr on lab.AdresaID = adr.IDAdresa inner join Adresa.Naselje as nas on adr.NaseljeID = nas.IDNaselje where ObrasciB1iB2 = 1"]
["DATA_SHEET_POKAZATELJI","SELECT pok.Naziv , pok.IDPokazatelj , pok.Sifra , mj.Naziv as MjJed FROM Pokazatelj.PokazateljModul AS modul INNER JOIN Pokazatelj.Pokazatelj AS pok ON modul.PokazateljID = pok.IDPokazatelj INNER JOIN Pokazatelj.MjernaJedinica AS mj ON pok.MjernaJedinicaID = mj.IDMjernaJedinica WHERE modul.ModulID = 3 AND NOT pok.Sifra IN ('FKP0003-0001','REK0001-0001','REK0002-0001','FKP0005-0001','FKP0006-0001','REK0004-0002' ,'FKP0011-0001','ION0015-0002','FKP0018-0002','FKP0020-0001','FKP0022-0001','FKP0023-0001','FKP0013-0001')"]
["DATA_SHEET_VRSTE_PRIJAMNIKA","SELECT Naziv, IDVrstaPrijemnika FROM ZastitaVoda.VrstaPrijemnika"]
["DATA_SHEET_VRSTA_OKNA","SELECT Naziv, IDVrstaOkna FROM ZastitaVoda.VrstaOkna WHERE Naziv LIKE '%kakvoća%'"]
["DATA_SHEET_NAC_ODR_PROT","select Naziv, IDNacinOdredivanjaProtoka from ZastitaVoda.NacinOdredivanjaProtoka"]
["DATA_SHEET_FREKV_UZORK","select Vrijeme, IDPeriodUzorkovanja from ZastitaVoda.PeriodUzorkovanja where VremenskiTipUzorkovanjaID = 1"]
["DATA_SHEET_TRAJ_UZORK","select Vrijeme, IDPeriodUzorkovanja from ZastitaVoda.PeriodUzorkovanja where VremenskiTipUzorkovanjaID = 2"]

{"sheet":"DATA_SHEET_FREKV_UZORK","index":6,"n_rows":4,"n_cols":2,"rows_kept":4,"cut":false,"hidden":true,"merged":[]}
["Vrijeme","IDPeriodUzorkovanja"]
[0.5,1]
[1,2]
[2,3]

{"sheet":"DATA_SHEET_VRSTA_OKNA","index":7,"n_rows":3,"n_cols":2,"rows_kept":3,"cut":false,"hidden":true,"merged":[]}
["Naziv","IDVrstaOkna"]
["Ulaz - kakvoća",2]
["Izlaz - kakvoća",4]

{"sheet":"DATA_SHEET_VRSTE_PRIJAMNIKA","index":8,"n_rows":4,"n_cols":2,"rows_kept":4,"cut":false,"hidden":true,"merged":[]}
["Naziv","IDVrstaPrijemnika"]
["Prirodni prijemnik",1]
["Sustav javne odvodnje",2]
["Sustav JO - pražnjenje sabirne jame",3]

{"sheet":"DATA_SHEET_VREMENSKI_UVJETI","index":9,"n_rows":5,"n_cols":2,"rows_kept":5,"cut":false,"hidden":true,"merged":[]}
["Naziv","ID"]
["Slaba kiša",10]
["Umjerena kiša",11]
["Jaka kiša",12]
["Bez oborina",13]

{"sheet":"DATA_SHEET_LABORATORIJI","index":10,"n_rows":50,"n_cols":7,"rows_kept":50,"cut":false,"hidden":true,"merged":[]}
["NazivLaboratorijaOtpadneVode","IDLaboratorij","Naselje","Ulica","SEARCH","FREQUENCY","FINAL LIST"]
["Zavod za javno zdravstvo Karlovačke županije",2,"Karlovac","Dr. V. Mačeka 48",{"$f":"IFERROR(SEARCH(INDIRECT(CELL(\"address\")),A2),0)","v":1},{"$f":"IF(E2=0,\"\",COUNTIF($E$2:E2,\">0\"))","v":1},{"$f":"IFERROR(INDEX(A:A,MATCH(ROW(E1),F:F,0)),\"\")","v":"Zavod za javno zdravstvo Karlovačke županije"}]
["ZAVOD ZA JAVNO ZDRAVSTVO Krapinsko-zagorske županije",3,"Zlatar","Ivana Gorana Kovačića 1",{"$f":"IFERROR(SEARCH(INDIRECT(CELL(\"address\")),A3),0)","v":1},{"$f":"IF(E3=0,\"\",COUNTIF($E$2:E3,\">0\"))","v":2},{"$f":"IFERROR(INDEX(A:A,MATCH(ROW(E2),F:F,0)),\"\")","v":"ZAVOD ZA JAVNO ZDRAVSTVO Krapinsko-zagorske županije"}]
["Nastavni zavod za javno zdravstvo dr. Andrija Štampar",4,"Zagreb","Mirogojska cesta 16",1,{"$f":"IF(E4=0,\"\",COUNTIF($E$2:E4,\">0\"))","v":3},"Nastavni zavod za javno zdravstvo dr. Andrija Štampar"]
["Zavod za javno zdravstvo Sisačko-moslavačke županije",5,"Sisak","Kralja Tomislava 1",1,{"$f":"IF(E5=0,\"\",COUNTIF($E$2:E5,\">0\"))","v":4},"Zavod za javno zdravstvo Sisačko-moslavačke županije"]
["Sveučilište u Zagrebu, Medicinski fakultet, Škola narodnog zdravlja \"Andrija Štampar\"",8,"Zagreb","Rockefellerova 4",1,{"$f":"IF(E6=0,\"\",COUNTIF($E$2:E6,\">0\"))","v":5},"Sveučilište u Zagrebu, Medicinski fakultet, Škola narodnog zdravlja \"Andrija Štampar\""]
["BIOINSTITUT d.o.o. ",9,"Čakovec","dr. Rudolfa Steinera 7",1,{"$f":"IF(E7=0,\"\",COUNTIF($E$2:E7,\">0\"))","v":6},"BIOINSTITUT d.o.o. "]
["Zavod za javno zdravstvo Koprivničko-križevačke županije",10,"Koprivnica","Trg Tomislava dr. Bardeka 10/10",1,{"$f":"IF(E8=0,\"\",COUNTIF($E$2:E8,\">0\"))","v":7},"Zavod za javno zdravstvo Koprivničko-križevačke županije"]
["Nastavni zavod za javno zdravstvo Osječko - baranjske županije",11,"Osijek","Drinska 8",1,{"$f":"IF(E9=0,\"\",COUNTIF($E$2:E9,\">0\"))","v":8},"Nastavni zavod za javno zdravstvo Osječko - baranjske županije"]
["Zavod za javno zdravstvo Varaždinske županije",12,"Varaždin","Meštrovićeva ulica 1/11",1,{"$f":"IF(E10=0,\"\",COUNTIF($E$2:E10,\">0\"))","v":9},"Zavod za javno zdravstvo Varaždinske županije"]
["Nastavni zavod za javno zdravstvo Istarske županije - Istituto formativo di sanita pubblica della regione Istriana",13,"Pula","Nazorova ulica 23",1,{"$f":"IF(E11=0,\"\",COUNTIF($E$2:E11,\">0\"))","v":10},"Nastavni zavod za javno zdravstvo Istarske županije - Istituto formativo di sanita pubblica della regione Istriana"]
["Nastavni zavod za javno zdravstvo Primorsko - goranske županije",14,"Rijeka","Krešimirova ulica 52a",1,{"$f":"IF(E12=0,\"\",COUNTIF($E$2:E12,\">0\"))","v":11},"Nastavni zavod za javno zdravstvo Primorsko - goranske županije"]
["Nastavni zavod za javno zdravstvo Splitsko-dalmatinske županije",16,"Split","Vukovarska ulica 46",1,{"$f":"IF(E13=0,\"\",COUNTIF($E$2:E13,\">0\"))","v":12},"Nastavni zavod za javno zdravstvo Splitsko-dalmatinske županije"]
["Zavod za javno zdravstvo Zadar",17,"Zadar","Kolovare 2",1,{"$f":"IF(E14=0,\"\",COUNTIF($E$2:E14,\">0\"))","v":13},"Zavod za javno zdravstvo Zadar"]
["Zavod za javno zdravstvo Ličko-senjske županije",19,"Gospić","Senjskih žrtava 2",1,{"$f":"IF(E15=0,\"\",COUNTIF($E$2:E15,\">0\"))","v":14},"Zavod za javno zdravstvo Ličko-senjske županije"]
["Hrvatski zavod za javno zdravstvo",20,"Zagreb","Rockefellerova 7",1,{"$f":"IF(E16=0,\"\",COUNTIF($E$2:E16,\">0\"))","v":15},"Hrvatski zavod za javno zdravstvo"]
["Vodoopskrba i odvodnja d.o.o., Laboratorij tehnološke službe odvodnje (LTSO)",116,"Zagreb","Folnegovićeva ulica 1",1,{"$f":"IF(E17=0,\"\",COUNTIF($E$2:E17,\">0\"))","v":16},"Vodoopskrba i odvodnja d.o.o., Laboratorij tehnološke službe odvodnje (LTSO)"]
["Cemtra d.o.o.",119,"Zagreb","Vlaška 67",1,{"$f":"IF(E18=0,\"\",COUNTIF($E$2:E18,\">0\"))","v":17},"Cemtra d.o.o."]
["E.C. Inspekt d.o.o.",122,"Zagreb","Pupačićeva 2",1,{"$f":"IF(E19=0,\"\",COUNTIF($E$2:E19,\">0\"))","v":18},"E.C. Inspekt d.o.o."]
["Vodovod-Osijek d.o.o.",124,"Osijek","Poljski put 1",1,{"$f":"IF(E20=0,\"\",COUNTIF($E$2:E20,\">0\"))","v":19},"Vodovod-Osijek d.o.o."]
["EUROINSPEKT-TEHNOKEM d.o.o. ",125,"Zagreb","Ivekovićeve stube 9",1,{"$f":"IF(E21=0,\"\",COUNTIF($E$2:E21,\">0\"))","v":20},"EUROINSPEKT-TEHNOKEM d.o.o. "]
["EUROFINS CROATIAKONTROLA d.o.o.",126,"Zagreb","Karlovačka cesta 4L",1,{"$f":"IF(E22=0,\"\",COUNTIF($E$2:E22,\">0\"))","v":21},"EUROFINS CROATIAKONTROLA d.o.o."]
["HIDRO.LAB. d.o.o.",127,"Ičići","Kolavići 5",1,{"$f":"IF(E23=0,\"\",COUNTIF($E$2:E23,\">0\"))","v":22},"HIDRO.LAB. d.o.o."]
["INA-Industrija nafte d.d., Centralni ispitni laboratorij",131,"Zagreb","Lovinčićeva 4",1,{"$f":"IF(E24=0,\"\",COUNTIF($E$2:E24,\">0\"))","v":23},"INA-Industrija nafte d.d., Centralni ispitni laboratorij"]
["PETROKEMIJA, d.d. tvornica gnojiva ",142,"Kutina","Aleja Vukovara 4",1,{"$f":"IF(E25=0,\"\",COUNTIF($E$2:E25,\">0\"))","v":24},"PETROKEMIJA, d.d. tvornica gnojiva "]
["HRVATSKI VETERINARSKI INSTITUT, Podružnica Veterinarski zavod Križevci",148,"Križevci","Zakmardijeva 10",1,{"$f":"IF(E26=0,\"\",COUNTIF($E$2:E26,\">0\"))","v":25},"HRVATSKI VETERINARSKI INSTITUT, Podružnica Veterinarski zavod Križevci"]
["HRVATSKI VETERINARSKI INSTITUT, Podružnica Veterinarski zavod Vinkovci",149,"Vinkovci","J. Kozarca 24",1,{"$f":"IF(E27=0,\"\",COUNTIF($E$2:E27,\">0\"))","v":26},"HRVATSKI VETERINARSKI INSTITUT, Podružnica Veterinarski zavod Vinkovci"]
["Zagrebačke otpadne vode - upravljanje i pogon d.o.o.",153,"Zagreb","Čulinečka cesta 287",1,{"$f":"IF(E28=0,\"\",COUNTIF($E$2:E28,\">0\"))","v":27},"Zagrebačke otpadne vode - upravljanje i pogon d.o.o."]
["Zavod za javno zdravstvo Bjelovarsko-bilogorske županije ",155,"Bjelovar","Matice hrvatske 15",1,{"$f":"IF(E29=0,\"\",COUNTIF($E$2:E29,\">0\"))","v":28},"Zavod za javno zdravstvo Bjelovarsko-bilogorske županije "]
["Nastavni zavod za javno zdravstvo Brodsko-posavske županije ",156,"Slavonski Brod","Vladimira Nazora 2a",1,{"$f":"IF(E30=0,\"\",COUNTIF($E$2:E30,\">0\"))","v":29},"Nastavni zavod za javno zdravstvo Brodsko-posavske županije "]
["Zavod za javno zdravstvo Dubrovačko-neretvanske županije",157,"Dubrovnik","dr. Ante Šercera 4a",1,{"$f":"IF(E31=0,\"\",COUNTIF($E$2:E31,\">0\"))","v":30},"Zavod za javno zdravstvo Dubrovačko-neretvanske županije"]
["ZAVOD ZA JAVNO ZDRAVSTVO SVETI ROK VIROVITIČKO-PODRAVSKE ŽUPANIJE ",158,"Virovitica","Ljudevita Gaja 21",1,{"$f":"IF(E32=0,\"\",COUNTIF($E$2:E32,\">0\"))","v":31},"ZAVOD ZA JAVNO ZDRAVSTVO SVETI ROK VIROVITIČKO-PODRAVSKE ŽUPANIJE "]
["Zavod za javno zdravstvo Šibensko-kninske županije",159,"Šibenik","Put groblja 6",1,{"$f":"IF(E33=0,\"\",COUNTIF($E$2:E33,\">0\"))","v":32},"Zavod za javno zdravstvo Šibensko-kninske županije"]
["Hrvatske vode, Glavni vodnogospodarski laboratorij",161,"Zagreb","Ulica grada Vukovara 220",1,{"$f":"IF(E34=0,\"\",COUNTIF($E$2:E34,\">0\"))","v":33},"Hrvatske vode, Glavni vodnogospodarski laboratorij"]
["RiEKO - LAB d.o.o.",162,"Rijeka","J.P. Kamova 19",1,{"$f":"IF(E35=0,\"\",COUNTIF($E$2:E35,\">0\"))","v":34},"RiEKO - LAB d.o.o."]
["INSPECTO d.o.o. za kontrolu kakvoće robe ",163,"Osijek","M. Divalta 193",1,{"$f":"IF(E36=0,\"\",COUNTIF($E$2:E36,\">0\"))","v":35},"INSPECTO d.o.o. za kontrolu kakvoće robe "]
["Labosan d.o.o., Laboratorij Virovitica",169,"Virovitica","Matije Gupca 254",1,{"$f":"IF(E37=0,\"\",COUNTIF($E$2:E37,\">0\"))","v":36},"Labosan d.o.o., Laboratorij Virovitica"]
["Institut Ruđer Bošković, Zavod za istraživanje mora i okoliša",171,"Zagreb","Bijenička cesta 54",1,{"$f":"IF(E38=0,\"\",COUNTIF($E$2:E38,\">0\"))","v":37},"Institut Ruđer Bošković, Zavod za istraživanje mora i okoliša"]
["Institut IGH d.d.",172,"Zagreb","Janka Rakuše 1",1,{"$f":"IF(E39=0,\"\",COUNTIF($E$2:E39,\">0\"))","v":38},"Institut IGH d.d."]
["Labosan d.o.o., Laboratorij Zagreb",173,"Zagreb","Rim 42",1,{"$f":"IF(E40=0,\"\",COUNTIF($E$2:E40,\">0\"))","v":39},"Labosan d.o.o., Laboratorij Zagreb"]
["Sample control d.o.o.",174,"Zagreb","Franje Puškarića 18",1,{"$f":"IF(E41=0,\"\",COUNTIF($E$2:E41,\">0\"))","v":40},"Sample control d.o.o."]
["Varkom d.d.",175,"Varaždin","Pavleka Miškine 67a",1,{"$f":"IF(E42=0,\"\",COUNTIF($E$2:E42,\">0\"))","v":41},"Varkom d.d."]
["Ostali vanjski laboratoriji",177,"Nepoznat",null,1,{"$f":"IF(E43=0,\"\",COUNTIF($E$2:E43,\">0\"))","v":42},"Ostali vanjski laboratoriji"]
["Onečišćivač - samostalno",178,"Nepoznat",null,1,{"$f":"IF(E44=0,\"\",COUNTIF($E$2:E44,\">0\"))","v":43},"Onečišćivač - samostalno"]
["KD VODOVOD I KANALIZACIJA d. o. o.",179,"Rijeka","Delta 3",1,{"$f":"IF(E45=0,\"\",COUNTIF($E$2:E45,\">0\"))","v":44},"KD VODOVOD I KANALIZACIJA d. o. o."]
["ZAVOD ZA JAVNO ZDRAVSTVO POŽEŠKO-SLAVONSKE ŽUPANIJE",180,"Požega","Županijska 9",1,{"$f":"IF(E46=0,\"\",COUNTIF($E$2:E46,\">0\"))","v":45},"ZAVOD ZA JAVNO ZDRAVSTVO POŽEŠKO-SLAVONSKE ŽUPANIJE"]
["INGINSPEKT-OPATIJA d.o.o.",185,"Matulji","Frana Supila 2A",1,{"$f":"IF(E47=0,\"\",COUNTIF($E$2:E47,\">0\"))","v":46},"INGINSPEKT-OPATIJA d.o.o."]
["ZAVOD ZA JAVNO ZDRAVSTVO ZAGREBAČKE ŽUPANIJE",188,"Rakitje","Školska 2",1,{"$f":"IF(E48=0,\"\",COUNTIF($E$2:E48,\">0\"))","v":47},"ZAVOD ZA JAVNO ZDRAVSTVO ZAGREBAČKE ŽUPANIJE"]
["J.S. Hamilton Croatia d.o.o., PJ1 Laboratorij",189,"Zadar","Ante Starčevića 15",{"$f":"IFERROR(SEARCH(INDIRECT(CELL(\"address\")),A49),0)","v":1},{"$f":"IF(E49=0,\"\",COUNTIF($E$2:E49,\">0\"))","v":48},{"$f":"IFERROR(INDEX(A:A,MATCH(ROW(E48),F:F,0)),\"\")","v":"J.S. Hamilton Croatia d.o.o., PJ1 Laboratorij"}]
["CROTEH d.o.o., Laboratorij za ekotehnologije",191,"Zagreb","Avenija Dubrovnik 15",1,{"$f":"IF(E50=0,\"\",COUNTIF($E$2:E50,\">0\"))","v":49},{"$f":"IFERROR(INDEX(A:A,MATCH(ROW(E49),F:F,0)),\"\")","v":"CROTEH d.o.o., Laboratorij za ekotehnologije"}]

{"sheet":"DATA_SHEET_POKAZATELJI","index":11,"n_rows":325,"n_cols":8,"rows_kept":325,"cut":false,"hidden":true,"merged":[]}
["Naziv","IDPokazatelj","Sifra","MjJed","UNIQUE","SEARCH","FREQUENCY","FINAL LIST"]
["1,1,1-trikloretan",2,"ORG0001-0002","mg/l",{"$f":"IF(ISERROR(VLOOKUP(A2,'Obrazac B2'!$C$55:'Obrazac B2'!$C$58,1,FALSE)),A2,\"\")","v":"1,1,1-trikloretan"},{"$f":"IFERROR(SEARCH(INDIRECT(CELL(\"address\")),E2),0)","v":1},{"$f":"IF(F2=0,\"\",COUNTIF($F$2:F2,\">0\"))","v":1},{"$f":"IFERROR(INDEX(E:E,MATCH(ROW(F1),G:G,0)),\"\")","v":"1,1,1-trikloretan"}]
["1,1-dikloreten",4,"ORG0002-0001","mg/l",{"$f":"IF(ISERROR(VLOOKUP(A3,'Obrazac B2'!$C$55:'Obrazac B2'!$C$58,1,FALSE)),A3,\"\")","v":"1,1-dikloreten"},{"$f":"IFERROR(SEARCH(INDIRECT(CELL(\"address\")),E3),0)","v":1},{"$f":"IF(F3=0,\"\",COUNTIF($F$2:F3,\">0\"))","v":2},"1,1-dikloreten"]
["1,2,3,4,6,7,8,9-Oktaklordibenzodioksin (OCDD) ",5,"ORG0003-0001","ng/l",{"$f":"IF(ISERROR(VLOOKUP(A4,'Obrazac B2'!$C$55:'Obrazac B2'!$C$58,1,FALSE)),A4,\"\")","v":"1,2,3,4,6,7,8,9-Oktaklordibenzodioksin (OCDD) "},1,{"$f":"IF(F4=0,\"\",COUNTIF($F$2:F4,\">0\"))","v":3},"1,2,3,4,6,7,8,9-Oktaklordibenzodioksin (OCDD) "]
["1,2,3,4,6,7,8,9-Oktaklordibenzofuran (OCDF) ",8,"ORG0004-0001","ng/l",{"$f":"IF(ISERROR(VLOOKUP(A5,'Obrazac B2'!$C$55:'Obrazac B2'!$C$58,1,FALSE)),A5,\"\")","v":"1,2,3,4,6,7,8,9-Oktaklordibenzofuran (OCDF) "},1,{"$f":"IF(F5=0,\"\",COUNTIF($F$2:F5,\">0\"))","v":4},"1,2,3,4,6,7,8,9-Oktaklordibenzofuran (OCDF) "]
["1,2,3,4,6,7,8-Heptaklordibenzodioksin (HpCDD) ",11,"ORG0005-0001","ng/l",{"$f":"IF(ISERROR(VLOOKUP(A6,'Obrazac B2'!$C$55:'Obrazac B2'!$C$58,1,FALSE)),A6,\"\")","v":"1,2,3,4,6,7,8-Heptaklordibenzodioksin (HpCDD) "},1,{"$f":"IF(F6=0,\"\",COUNTIF($F$2:F6,\">0\"))","v":5},"1,2,3,4,6,7,8-Heptaklordibenzodioksin (HpCDD) "]
["1,2,3,4,6,7,8-Heptaklordibenzofuran (HpCDF) ",14,"ORG0006-0001","ng/l",{"$f":"IF(ISERROR(VLOOKUP(A7,'Obrazac B2'!$C$55:'Obrazac B2'!$C$58,1,FALSE)),A7,\"\")","v":"1,2,3,4,6,7,8-Heptaklordibenzofuran (HpCDF) "},1,{"$f":"IF(F7=0,\"\",COUNTIF($F$2:F7,\">0\"))","v":6},"1,2,3,4,6,7,8-Heptaklordibenzofuran (HpCDF) "]
["1,2,3,4,7,8,9-Heptaklordibenzofuran (HpCDF) ",17,"ORG0007-0001","ng/l",{"$f":"IF(ISERROR(VLOOKUP(A8,'Obrazac B2'!$C$55:'Obrazac B2'!$C$58,1,FALSE)),A8,\"\")","v":"1,2,3,4,7,8,9-Heptaklordibenzofuran (HpCDF) "},1,{"$f":"IF(F8=0,\"\",COUNTIF($F$2:F8,\">0\"))","v":7},"1,2,3,4,7,8,9-Heptaklordibenzofuran (HpCDF) "]
["1,2,3,4,7,8-Heksaklordibenzodioksin (HxCDD)",20,"ORG0008-0001","ng/l",{"$f":"IF(ISERROR(VLOOKUP(A9,'Obrazac B2'!$C$55:'Obrazac B2'!$C$58,1,FALSE)),A9,\"\")","v":"1,2,3,4,7,8-Heksaklordibenzodioksin (HxCDD)"},1,{"$f":"IF(F9=0,\"\",COUNTIF($F$2:F9,\">0\"))","v":8},"1,2,3,4,7,8-Heksaklordibenzodioksin (HxCDD)"]
["1,2,3,4,7,8-Heksaklordibenzofuran (HxCDF) ",23,"ORG0009-0001","ng/l",{"$f":"IF(ISERROR(VLOOKUP(A10,'Obrazac B2'!$C$55:'Obrazac B2'!$C$58,1,FALSE)),A10,\"\")","v":"1,2,3,4,7,8-Heksaklordibenzofuran (HxCDF) "},1,{"$f":"IF(F10=0,\"\",COUNTIF($F$2:F10,\">0\"))","v":9},"1,2,3,4,7,8-Heksaklordibenzofuran (HxCDF) "]
["1,2,3,6,7,8-Heksaklordibenzodioksin (HxCDD) ",26,"ORG0010-0001","ng/l",{"$f":"IF(ISERROR(VLOOKUP(A11,'Obrazac B2'!$C$55:'Obrazac B2'!$C$58,1,FALSE)),A11,\"\")","v":"1,2,3,6,7,8-Heksaklordibenzodioksin (HxCDD) "},1,{"$f":"IF(F11=0,\"\",COUNTIF($F$2:F11,\">0\"))","v":10},"1,2,3,6,7,8-Heksaklordibenzodioksin (HxCDD) "]
["1,2,3,6,7,8-Heksaklordibenzofuran (HxCDF) ",29,"ORG0011-0001","ng/l",{"$f":"IF(ISERROR(VLOOKUP(A12,'Obrazac B2'!$C$55:'Obrazac B2'!$C$58,1,FALSE)),A12,\"\")","v":"1,2,3,6,7,8-Heksaklordibenzofuran (HxCDF) "},1,{"$f":"IF(F12=0,\"\",COUNTIF($F$2:F12,\">0\"))","v":11},"1,2,3,6,7,8-Heksaklordibenzofuran (HxCDF) "]
["1,2,3,7,8,9-Heksaklordibenzodioksin (HxCDD)",32,"ORG0012-0001","ng/l",{"$f":"IF(ISERROR(VLOOKUP(A13,'Obrazac B2'!$C$55:'Obrazac B2'!$C$58,1,FALSE)),A13,\"\")","v":"1,2,3,7,8,9-Heksaklordibenzodioksin (HxCDD)"},1,{"$f":"IF(F13=0,\"\",COUNTIF($F$2:F13,\">0\"))","v":12},"1,2,3,7,8,9-Heksaklordibenzodioksin (HxCDD)"]
["1,2,3,7,8,9-Heksaklordibenzofuran (HxCDF) ",35,"ORG0013-0001","ng/l",{"$f":"IF(ISERROR(VLOOKUP(A14,'Obrazac B2'!$C$55:'Obrazac B2'!$C$58,1,FALSE)),A14,\"\")","v":"1,2,3,7,8,9-Heksaklordibenzofuran (HxCDF) "},1,{"$f":"IF(F14=0,\"\",COUNTIF($F$2:F14,\">0\"))","v":13},"1,2,3,7,8,9-Heksaklordibenzofuran (HxCDF) "]
["1,2,3,7,8-Pentaklordibenzodioksin (PeCDD)",38,"ORG0014-0001","ng/l",{"$f":"IF(ISERROR(VLOOKUP(A15,'Obrazac B2'!$C$55:'Obrazac B2'!$C$58,1,FALSE)),A15,\"\")","v":"1,2,3,7,8-Pentaklordibenzodioksin (PeCDD)"},1,{"$f":"IF(F15=0,\"\",COUNTIF($F$2:F15,\">0\"))","v":14},"1,2,3,7,8-Pentaklordibenzodioksin (PeCDD)"]
["1,2,3,7,8-Pentaklordibenzofuran (PeCDF)",41,"ORG0015-0001","ng/l",{"$f":"IF(ISERROR(VLOOKUP(A16,'Obrazac B2'!$C$55:'Obrazac B2'!$C$58,1,FALSE)),A16,\"\")","v":"1,2,3,7,8-Pentaklordibenzofuran (PeCDF)"},1,{"$f":"IF(F16=0,\"\",COUNTIF($F$2:F16,\">0\"))","v":15},"1,2,3,7,8-Pentaklordibenzofuran (PeCDF)"]
["1,2,3-triklorbenzen",45,"ORG0016-0002","mg/l",{"$f":"IF(ISERROR(VLOOKUP(A17,'Obrazac B2'!$C$55:'Obrazac B2'!$C$58,1,FALSE)),A17,\"\")","v":"1,2,3-triklorbenzen"},1,{"$f":"IF(F17=0,\"\",COUNTIF($F$2:F17,\">0\"))","v":16},"1,2,3-triklorbenzen"]
["1,2,4-triklorbenzen",48,"ORG0017-0002","mg/l",{"$f":"IF(ISERROR(VLOOKUP(A18,'Obrazac B2'!$C$55:'Obrazac B2'!$C$58,1,FALSE)),A18,\"\")","v":"1,2,4-triklorbenzen"},1,{"$f":"IF(F18=0,\"\",COUNTIF($F$2:F18,\">0\"))","v":17},"1,2,4-triklorbenzen"]
["1,2,5,6,9,10-heksabromociklododekan",51,"ORG0018-0002","mg/l",{"$f":"IF(ISERROR(VLOOKUP(A19,'Obrazac B2'!$C$55:'Obrazac B2'!$C$58,1,FALSE)),A19,\"\")","v":"1,2,5,6,9,10-heksabromociklododekan"},1,{"$f":"IF(F19=0,\"\",COUNTIF($F$2:F19,\">0\"))","v":18},"1,2,5,6,9,10-heksabromociklododekan"]
["1,2-dikloretan",54,"ORG0019-0002","mg/l",{"$f":"IF(ISERROR(VLOOKUP(A20,'Obrazac B2'!$C$55:'Obrazac B2'!$C$58,1,FALSE)),A20,\"\")","v":"1,2-dikloretan"},1,{"$f":"IF(F20=0,\"\",COUNTIF($F$2:F20,\">0\"))","v":19},"1,2-dikloretan"]
["1,3,5,7,9,11-heksabromociklododekan ",57,"ORG0020-0002","mg/l",{"$f":"IF(ISERROR(VLOOKUP(A21,'Obrazac B2'!$C$55:'Obrazac B2'!$C$58,1,FALSE)),A21,\"\")","v":"1,3,5,7,9,11-heksabromociklododekan "},1,{"$f":"IF(F21=0,\"\",COUNTIF($F$2:F21,\">0\"))","v":20},"1,3,5,7,9,11-heksabromociklododekan "]
["1,3,5-triklorbenzen",60,"ORG0021-0002","mg/l",{"$f":"IF(ISERROR(VLOOKUP(A22,'Obrazac B2'!$C$55:'Obrazac B2'!$C$58,1,FALSE)),A22,\"\")","v":"1,3,5-triklorbenzen"},1,{"$f":"IF(F22=0,\"\",COUNTIF($F$2:F22,\">0\"))","v":21},"1,3,5-triklorbenzen"]
["2,3,4,6,7,8-Heksaklordibenzofuran (HxCDF) ",62,"ORG0022-0001","ng/l",{"$f":"IF(ISERROR(VLOOKUP(A23,'Obrazac B2'!$C$55:'Obrazac B2'!$C$58,1,FALSE)),A23,\"\")","v":"2,3,4,6,7,8-Heksaklordibenzofuran (HxCDF) "},1,{"$f":"IF(F23=0,\"\",COUNTIF($F$2:F23,\">0\"))","v":22},"2,3,4,6,7,8-Heksaklordibenzofuran (HxCDF) "]
["2,3,4,7,8-Pentaklordibenzofuran (PeCDF) ",65,"ORG0023-0001","ng/l",{"$f":"IF(ISERROR(VLOOKUP(A24,'Obrazac B2'!$C$55:'Obrazac B2'!$C$58,1,FALSE)),A24,\"\")","v":"2,3,4,7,8-Pentaklordibenzofuran (PeCDF) "},1,{"$f":"IF(F24=0,\"\",COUNTIF($F$2:F24,\">0\"))","v":23},"2,3,4,7,8-Pentaklordibenzofuran (PeCDF) "]
["2,3,7,8-Tetraklordibenzodioksin (TCDD)",68,"ORG0024-0001","ng/l",{"$f":"IF(ISERROR(VLOOKUP(A25,'Obrazac B2'!$C$55:'Obrazac B2'!$C$58,1,FALSE)),A25,\"\")","v":"2,3,7,8-Tetraklordibenzodioksin (TCDD)"},1,{"$f":"IF(F25=0,\"\",COUNTIF($F$2:F25,\">0\"))","v":24},"2,3,7,8-Tetraklordibenzodioksin (TCDD)"]
["2,3,7,8-Tetraklordibenzofuran (TCDF)",71,"ORG0025-0001","ng/l",{"$f":"IF(ISERROR(VLOOKUP(A26,'Obrazac B2'!$C$55:'Obrazac B2'!$C$58,1,FALSE)),A26,\"\")","v":"2,3,7,8-Tetraklordibenzofuran (TCDF)"},1,{"$f":"IF(F26=0,\"\",COUNTIF($F$2:F26,\">0\"))","v":25},"2,3,7,8-Tetraklordibenzofuran (TCDF)"]
["2,4' DDT",75,"ORG0026-0002","mg/l",{"$f":"IF(ISERROR(VLOOKUP(A27,'Obrazac B2'!$C$55:'Obrazac B2'!$C$58,1,FALSE)),A27,\"\")","v":"2,4' DDT"},1,{"$f":"IF(F27=0,\"\",COUNTIF($F$2:F27,\">0\"))","v":26},"2,4' DDT"]
["4,4' DDD",85,"ORG0032-0002","mg/l",{"$f":"IF(ISERROR(VLOOKUP(A28,'Obrazac B2'!$C$55:'Obrazac B2'!$C$58,1,FALSE)),A28,\"\")","v":"4,4' DDD"},1,{"$f":"IF(F28=0,\"\",COUNTIF($F$2:F28,\">0\"))","v":27},"4,4' DDD"]
["4,4' DDE",88,"ORG0033-0002","mg/l",{"$f":"IF(ISERROR(VLOOKUP(A29,'Obrazac B2'!$C$55:'Obrazac B2'!$C$58,1,FALSE)),A29,\"\")","v":"4,4' DDE"},1,{"$f":"IF(F29=0,\"\",COUNTIF($F$2:F29,\">0\"))","v":28},"4,4' DDE"]
["4,4' DDT",91,"ORG0034-0002","mg/l",{"$f":"IF(ISERROR(VLOOKUP(A30,'Obrazac B2'!$C$55:'Obrazac B2'!$C$58,1,FALSE)),A30,\"\")","v":"4,4' DDT"},1,{"$f":"IF(F30=0,\"\",COUNTIF($F$2:F30,\">0\"))","v":29},"4,4' DDT"]
["Adsorbilni organski halogeni (AOX)",100,"ORG0039-0002","mg/l",{"$f":"IF(ISERROR(VLOOKUP(A31,'Obrazac B2'!$C$55:'Obrazac B2'!$C$58,1,FALSE)),A31,\"\")","v":"Adsorbilni organski halogeni (AOX)"},1,{"$f":"IF(F31=0,\"\",COUNTIF($F$2:F31,\">0\"))","v":30},"Adsorbilni organski halogeni (AOX)"]
["Aklonifen",102,"ORG0040-0002","mg/l",{"$f":"IF(ISERROR(VLOOKUP(A32,'Obrazac B2'!$C$55:'Obrazac B2'!$C$58,1,FALSE)),A32,\"\")","v":"Aklonifen"},1,{"$f":"IF(F32=0,\"\",COUNTIF($F$2:F32,\">0\"))","v":31},"Aklonifen"]
["Akrilonitril",105,"ORG0042-0001","mg/l",{"$f":"IF(ISERROR(VLOOKUP(A33,'Obrazac B2'!$C$55:'Obrazac B2'!$C$58,1,FALSE)),A33,\"\")","v":"Akrilonitril"},1,{"$f":"IF(F33=0,\"\",COUNTIF($F$2:F33,\">0\"))","v":32},"Akrilonitril"]
["Alaklor",107,"ORG0043-0002","mg/l",{"$f":"IF(ISERROR(VLOOKUP(A34,'Obrazac B2'!$C$55:'Obrazac B2'!$C$58,1,FALSE)),A34,\"\")","v":"Alaklor"},1,{"$f":"IF(F34=0,\"\",COUNTIF($F$2:F34,\">0\"))","v":33},"Alaklor"]
["Aldrin",110,"ORG0044-0002","mg/l",{"$f":"IF(ISERROR(VLOOKUP(A35,'Obrazac B2'!$C$55:'Obrazac B2'!$C$58,1,FALSE)),A35,\"\")","v":"Aldrin"},1,{"$f":"IF(F35=0,\"\",COUNTIF($F$2:F35,\">0\"))","v":34},"Aldrin"]
["Aluminij ukupni",118,"MET0001-0003","mg/l",{"$f":"IF(ISERROR(VLOOKUP(A36,'Obrazac B2'!$C$55:'Obrazac B2'!$C$58,1,FALSE)),A36,\"\")","v":"Aluminij ukupni"},1,{"$f":"IF(F36=0,\"\",COUNTIF($F$2:F36,\">0\"))","v":35},"Aluminij ukupni"]
["Amonij",121,"HRT0001-0001","mgN/l",{"$f":"IF(ISERROR(VLOOKUP(A37,'Obrazac B2'!$C$55:'Obrazac B2'!$C$58,1,FALSE)),A37,\"\")","v":"Amonij"},1,{"$f":"IF(F37=0,\"\",COUNTIF($F$2:F37,\">0\"))","v":36},"Amonij"]
["Anorganski dušik",124,"HRT0002-0001","mgN/l",{"$f":"IF(ISERROR(VLOOKUP(A38,'Obrazac B2'!$C$55:'Obrazac B2'!$C$58,1,FALSE)),A38,\"\")","v":"Anorganski dušik"},1,{"$f":"IF(F38=0,\"\",COUNTIF($F$2:F38,\">0\"))","v":37},"Anorganski dušik"]
["Antimon otopljeni",126,"MET0002-0002","mg/l",{"$f":"IF(ISERROR(VLOOKUP(A39,'Obrazac B2'!$C$55:'Obrazac B2'!$C$58,1,FALSE)),A39,\"\")","v":"Antimon otopljeni"},1,{"$f":"IF(F39=0,\"\",COUNTIF($F$2:F39,\">0\"))","v":38},"Antimon otopljeni"]
["Antimon ukupni",128,"MET0002-0004","mg/l",{"$f":"IF(ISERROR(VLOOKUP(A40,'Obrazac B2'!$C$55:'Obrazac B2'!$C$58,1,FALSE)),A40,\"\")","v":"Antimon ukupni"},1,{"$f":"IF(F40=0,\"\",COUNTIF($F$2:F40,\">0\"))","v":39},"Antimon ukupni"]
["Antracen",130,"ORG0047-0002","mg/l",{"$f":"IF(ISERROR(VLOOKUP(A41,'Obrazac B2'!$C$55:'Obrazac B2'!$C$58,1,FALSE)),A41,\"\")","v":"Antracen"},1,{"$f":"IF(F41=0,\"\",COUNTIF($F$2:F41,\">0\"))","v":40},"Antracen"]
["Arsen otopljeni",133,"MET0003-0002","mg/l",{"$f":"IF(ISERROR(VLOOKUP(A42,'Obrazac B2'!$C$55:'Obrazac B2'!$C$58,1,FALSE)),A42,\"\")","v":"Arsen otopljeni"},1,{"$f":"IF(F42=0,\"\",COUNTIF($F$2:F42,\">0\"))","v":41},"Arsen otopljeni"]
["Arsen ukupni",135,"MET0003-0004","mg/l",{"$f":"IF(ISERROR(VLOOKUP(A43,'Obrazac B2'!$C$55:'Obrazac B2'!$C$58,1,FALSE)),A43,\"\")","v":"Arsen ukupni"},1,{"$f":"IF(F43=0,\"\",COUNTIF($F$2:F43,\">0\"))","v":42},"Arsen ukupni"]
["Atrazin",138,"ORG0048-0002","mg/l",{"$f":"IF(ISERROR(VLOOKUP(A44,'Obrazac B2'!$C$55:'Obrazac B2'!$C$58,1,FALSE)),A44,\"\")","v":"Atrazin"},1,{"$f":"IF(F44=0,\"\",COUNTIF($F$2:F44,\">0\"))","v":43},"Atrazin"]
["Azbest",140,"ORG0049-0001","mg/l",{"$f":"IF(ISERROR(VLOOKUP(A45,'Obrazac B2'!$C$55:'Obrazac B2'!$C$58,1,FALSE)),A45,\"\")","v":"Azbest"},1,{"$f":"IF(F45=0,\"\",COUNTIF($F$2:F45,\">0\"))","v":44},"Azbest"]
["Azinfos (-etil)",142,"ORG0050-0002","mg/l",{"$f":"IF(ISERROR(VLOOKUP(A46,'Obrazac B2'!$C$55:'Obrazac B2'!$C$58,1,FALSE)),A46,\"\")","v":"Azinfos (-etil)"},1,{"$f":"IF(F46=0,\"\",COUNTIF($F$2:F46,\">0\"))","v":45},"Azinfos (-etil)"]
["Azinfos (-metil)",144,"ORG0051-0002","mg/l",{"$f":"IF(ISERROR(VLOOKUP(A47,'Obrazac B2'!$C$55:'Obrazac B2'!$C$58,1,FALSE)),A47,\"\")","v":"Azinfos (-metil)"},1,{"$f":"IF(F47=0,\"\",COUNTIF($F$2:F47,\">0\"))","v":46},"Azinfos (-metil)"]
["Azitromicin",146,"ORG0052-0002","mg/l",{"$f":"IF(ISERROR(VLOOKUP(A48,'Obrazac B2'!$C$55:'Obrazac B2'!$C$58,1,FALSE)),A48,\"\")","v":"Azitromicin"},1,{"$f":"IF(F48=0,\"\",COUNTIF($F$2:F48,\">0\"))","v":47},"Azitromicin"]
["Azitromicin-N-dezmetilazitromicin",921,"ORG0311-0001","µg/l",{"$f":"IF(ISERROR(VLOOKUP(A49,'Obrazac B2'!$C$55:'Obrazac B2'!$C$58,1,FALSE)),A49,\"\")","v":"Azitromicin-N-dezmetilazitromicin"},{"$f":"IFERROR(SEARCH(INDIRECT(CELL(\"address\")),E49),0)","v":1},{"$f":"IF(F49=0,\"\",COUNTIF($F$2:F49,\">0\"))","v":48},"Azitromicin-N-dezmetilazitromicin"]
["Bakar otopljeni",148,"MET0004-0002","mg/l",{"$f":"IF(ISERROR(VLOOKUP(A50,'Obrazac B2'!$C$55:'Obrazac B2'!$C$58,1,FALSE)),A50,\"\")","v":"Bakar otopljeni"},1,{"$f":"IF(F50=0,\"\",COUNTIF($F$2:F50,\">0\"))","v":49},"Bakar otopljeni"]
["Bakar ukupni",150,"MET0004-0004","mg/l",{"$f":"IF(ISERROR(VLOOKUP(A51,'Obrazac B2'!$C$55:'Obrazac B2'!$C$58,1,FALSE)),A51,\"\")","v":"Bakar ukupni"},1,{"$f":"IF(F51=0,\"\",COUNTIF($F$2:F51,\">0\"))","v":50},"Bakar ukupni"]
["Barij otopljeni",153,"MET0005-0002","mg/l",{"$f":"IF(ISERROR(VLOOKUP(A52,'Obrazac B2'!$C$55:'Obrazac B2'!$C$58,1,FALSE)),A52,\"\")","v":"Barij otopljeni"},1,{"$f":"IF(F52=0,\"\",COUNTIF($F$2:F52,\">0\"))","v":51},"Barij otopljeni"]
["Barij ukupni",155,"MET0005-0004","mg/l",{"$f":"IF(ISERROR(VLOOKUP(A53,'Obrazac B2'!$C$55:'Obrazac B2'!$C$58,1,FALSE)),A53,\"\")","v":"Barij ukupni"},1,{"$f":"IF(F53=0,\"\",COUNTIF($F$2:F53,\">0\"))","v":52},"Barij ukupni"]
["Benzen",158,"ORG0054-0002","mg/l",{"$f":"IF(ISERROR(VLOOKUP(A54,'Obrazac B2'!$C$55:'Obrazac B2'!$C$58,1,FALSE)),A54,\"\")","v":"Benzen"},1,{"$f":"IF(F54=0,\"\",COUNTIF($F$2:F54,\">0\"))","v":53},"Benzen"]
["Benzo(a)piren",161,"ORG0055-0002","mg/l",{"$f":"IF(ISERROR(VLOOKUP(A55,'Obrazac B2'!$C$55:'Obrazac B2'!$C$58,1,FALSE)),A55,\"\")","v":"Benzo(a)piren"},1,{"$f":"IF(F55=0,\"\",COUNTIF($F$2:F55,\">0\"))","v":54},"Benzo(a)piren"]
["Benzo(b)fluoranten",164,"ORG0056-0002","mg/l",{"$f":"IF(ISERROR(VLOOKUP(A56,'Obrazac B2'!$C$55:'Obrazac B2'!$C$58,1,FALSE)),A56,\"\")","v":"Benzo(b)fluoranten"},1,{"$f":"IF(F56=0,\"\",COUNTIF($F$2:F56,\">0\"))","v":55},"Benzo(b)fluoranten"]
["Benzo(g,h,i)perilen",167,"ORG0057-0002","mg/l",{"$f":"IF(ISERROR(VLOOKUP(A57,'Obrazac B2'!$C$55:'Obrazac B2'!$C$58,1,FALSE)),A57,\"\")","v":"Benzo(g,h,i)perilen"},1,{"$f":"IF(F57=0,\"\",COUNTIF($F$2:F57,\">0\"))","v":56},"Benzo(g,h,i)perilen"]
["Benzo(k)fluoranten",170,"ORG0058-0002","mg/l",{"$f":"IF(ISERROR(VLOOKUP(A58,'Obrazac B2'!$C$55:'Obrazac B2'!$C$58,1,FALSE)),A58,\"\")","v":"Benzo(k)fluoranten"},1,{"$f":"IF(F58=0,\"\",COUNTIF($F$2:F58,\">0\"))","v":57},"Benzo(k)fluoranten"]
["Berilij otopljeni",173,"MET0006-0002","mg/l",{"$f":"IF(ISERROR(VLOOKUP(A59,'Obrazac B2'!$C$55:'Obrazac B2'!$C$58,1,FALSE)),A59,\"\")","v":"Berilij otopljeni"},1,{"$f":"IF(F59=0,\"\",COUNTIF($F$2:F59,\">0\"))","v":58},"Berilij otopljeni"]
["Berilij ukupni",175,"MET0006-0004","mg/l",{"$f":"IF(ISERROR(VLOOKUP(A60,'Obrazac B2'!$C$55:'Obrazac B2'!$C$58,1,FALSE)),A60,\"\")","v":"Berilij ukupni"},1,{"$f":"IF(F60=0,\"\",COUNTIF($F$2:F60,\">0\"))","v":59},"Berilij ukupni"]
["Bifenoks",179,"ORG0060-0002","mg/l",{"$f":"IF(ISERROR(VLOOKUP(A61,'Obrazac B2'!$C$55:'Obrazac B2'!$C$58,1,FALSE)),A61,\"\")","v":"Bifenoks"},1,{"$f":"IF(F61=0,\"\",COUNTIF($F$2:F61,\">0\"))","v":60},"Bifenoks"]
["Biološka razgradljivost OOU",181,"EKO0001-0001","nema",{"$f":"IF(ISERROR(VLOOKUP(A62,'Obrazac B2'!$C$55:'Obrazac B2'!$C$58,1,FALSE)),A62,\"\")","v":"Biološka razgradljivost OOU"},1,{"$f":"IF(F62=0,\"\",COUNTIF($F$2:F62,\">0\"))","v":61},"Biološka razgradljivost OOU"]
["Bor otopljeni",188,"MET0007-0002","mg/l",{"$f":"IF(ISERROR(VLOOKUP(A63,'Obrazac B2'!$C$55:'Obrazac B2'!$C$58,1,FALSE)),A63,\"\")","v":"Bor otopljeni"},1,{"$f":"IF(F63=0,\"\",COUNTIF($F$2:F63,\">0\"))","v":62},"Bor otopljeni"]
["Bor ukupni",190,"MET0007-0004","mg/l",{"$f":"IF(ISERROR(VLOOKUP(A64,'Obrazac B2'!$C$55:'Obrazac B2'!$C$58,1,FALSE)),A64,\"\")","v":"Bor ukupni"},1,{"$f":"IF(F64=0,\"\",COUNTIF($F$2:F64,\">0\"))","v":63},"Bor ukupni"]
["BPK5 teret",192,"TER0001-0001","kg/t proizv/sirovine",{"$f":"IF(ISERROR(VLOOKUP(A65,'Obrazac B2'!$C$55:'Obrazac B2'!$C$58,1,FALSE)),A65,\"\")","v":"BPK5 teret"},1,{"$f":"IF(F65=0,\"\",COUNTIF($F$2:F65,\">0\"))","v":64},"BPK5 teret"]
["Broj fekalnih koliforma",195,"MBP0003-0001","broj/100 ml",{"$f":"IF(ISERROR(VLOOKUP(A66,'Obrazac B2'!$C$55:'Obrazac B2'!$C$58,1,FALSE)),A66,\"\")","v":"Broj fekalnih koliforma"},1,{"$f":"IF(F66=0,\"\",COUNTIF($F$2:F66,\">0\"))","v":65},{"$f":"IFERROR(INDEX(E:E,MATCH(ROW(F65),G:G,0)),\"\")","v":"Broj fekalnih koliforma"}]
["Broj fekalnih streptokoka",196,"MBP0004-0001","broj/100 ml",{"$f":"IF(ISERROR(VLOOKUP(A67,'Obrazac B2'!$C$55:'Obrazac B2'!$C$58,1,FALSE)),A67,\"\")","v":"Broj fekalnih streptokoka"},1,{"$f":"IF(F67=0,\"\",COUNTIF($F$2:F67,\">0\"))","v":66},"Broj fekalnih streptokoka"]
["Bromdiklormetan",203,"ORG0064-0002","mg/l",{"$f":"IF(ISERROR(VLOOKUP(A68,'Obrazac B2'!$C$55:'Obrazac B2'!$C$58,1,FALSE)),A68,\"\")","v":"Bromdiklormetan"},{"$f":"IFERROR(SEARCH(INDIRECT(CELL(\"address\")),E68),0)","v":1},{"$f":"IF(F68=0,\"\",COUNTIF($F$2:F68,\">0\"))","v":67},"Bromdiklormetan"]
["Bromoform",207,"ORG0065-0002","mg/l",{"$f":"IF(ISERROR(VLOOKUP(A69,'Obrazac B2'!$C$55:'Obrazac B2'!$C$58,1,FALSE)),A69,\"\")","v":"Bromoform"},1,{"$f":"IF(F69=0,\"\",COUNTIF($F$2:F69,\">0\"))","v":68},"Bromoform"]
["C₁₀₋₁₃ kloralkani",212,"ORG0068-0002","mg/l",{"$f":"IF(ISERROR(VLOOKUP(A70,'Obrazac B2'!$C$55:'Obrazac B2'!$C$58,1,FALSE)),A70,\"\")","v":"C₁₀₋₁₃ kloralkani"},1,{"$f":"IF(F70=0,\"\",COUNTIF($F$2:F70,\">0\"))","v":69},"C₁₀₋₁₃ kloralkani"]
["Cibutrin",216,"ORG0070-0002","mg/l",{"$f":"IF(ISERROR(VLOOKUP(A71,'Obrazac B2'!$C$55:'Obrazac B2'!$C$58,1,FALSE)),A71,\"\")","v":"Cibutrin"},1,{"$f":"IF(F71=0,\"\",COUNTIF($F$2:F71,\">0\"))","v":70},"Cibutrin"]
["Cijanidi otopljeni",218,"ION0003-0001","mg/l",{"$f":"IF(ISERROR(VLOOKUP(A72,'Obrazac B2'!$C$55:'Obrazac B2'!$C$58,1,FALSE)),A72,\"\")","v":"Cijanidi otopljeni"},1,{"$f":"IF(F72=0,\"\",COUNTIF($F$2:F72,\">0\"))","v":71},"Cijanidi otopljeni"]
["Cijanidi slobodni",219,"ION0003-0002","mg/l",{"$f":"IF(ISERROR(VLOOKUP(A73,'Obrazac B2'!$C$55:'Obrazac B2'!$C$58,1,FALSE)),A73,\"\")","v":"Cijanidi slobodni"},1,{"$f":"IF(F73=0,\"\",COUNTIF($F$2:F73,\">0\"))","v":72},"Cijanidi slobodni"]
["Cijanidi ukupni",221,"ION0003-0004","mg/l",{"$f":"IF(ISERROR(VLOOKUP(A74,'Obrazac B2'!$C$55:'Obrazac B2'!$C$58,1,FALSE)),A74,\"\")","v":"Cijanidi ukupni"},1,{"$f":"IF(F74=0,\"\",COUNTIF($F$2:F74,\">0\"))","v":73},"Cijanidi ukupni"]
["Cink otopljeni",223,"MET0008-0002","mg/l",{"$f":"IF(ISERROR(VLOOKUP(A75,'Obrazac B2'!$C$55:'Obrazac B2'!$C$58,1,FALSE)),A75,\"\")","v":"Cink otopljeni"},1,{"$f":"IF(F75=0,\"\",COUNTIF($F$2:F75,\">0\"))","v":74},"Cink otopljeni"]
["Cink ukupni",225,"MET0008-0004","mg/l",{"$f":"IF(ISERROR(VLOOKUP(A76,'Obrazac B2'!$C$55:'Obrazac B2'!$C$58,1,FALSE)),A76,\"\")","v":"Cink ukupni"},1,{"$f":"IF(F76=0,\"\",COUNTIF($F$2:F76,\">0\"))","v":75},"Cink ukupni"]
["Cipermetrin",228,"ORG0071-0002","mg/l",{"$f":"IF(ISERROR(VLOOKUP(A77,'Obrazac B2'!$C$55:'Obrazac B2'!$C$58,1,FALSE)),A77,\"\")","v":"Cipermetrin"},1,{"$f":"IF(F77=0,\"\",COUNTIF($F$2:F77,\">0\"))","v":76},"Cipermetrin"]
["Crijevni enterokoki",237,"MBP0008-0001","broj/100 ml",{"$f":"IF(ISERROR(VLOOKUP(A78,'Obrazac B2'!$C$55:'Obrazac B2'!$C$58,1,FALSE)),A78,\"\")","v":"Crijevni enterokoki"},1,{"$f":"IF(F78=0,\"\",COUNTIF($F$2:F78,\">0\"))","v":77},"Crijevni enterokoki"]
["DDT ukupni ",240,"ORG0075-0003","mg/l",{"$f":"IF(ISERROR(VLOOKUP(A79,'Obrazac B2'!$C$55:'Obrazac B2'!$C$58,1,FALSE)),A79,\"\")","v":"DDT ukupni "},1,{"$f":"IF(F79=0,\"\",COUNTIF($F$2:F79,\">0\"))","v":78},"DDT ukupni "]
["Detergenti anionski",247,"ORG0080-0002","mg/l",{"$f":"IF(ISERROR(VLOOKUP(A80,'Obrazac B2'!$C$55:'Obrazac B2'!$C$58,1,FALSE)),A80,\"\")","v":"Detergenti anionski"},1,{"$f":"IF(F80=0,\"\",COUNTIF($F$2:F80,\">0\"))","v":79},"Detergenti anionski"]
["Detergenti kationski ",249,"ORG0081-0001","mg/l",{"$f":"IF(ISERROR(VLOOKUP(A81,'Obrazac B2'!$C$55:'Obrazac B2'!$C$58,1,FALSE)),A81,\"\")","v":"Detergenti kationski "},1,{"$f":"IF(F81=0,\"\",COUNTIF($F$2:F81,\">0\"))","v":80},"Detergenti kationski "]
["Detergenti neionski",251,"ORG0082-0002","mg/l",{"$f":"IF(ISERROR(VLOOKUP(A82,'Obrazac B2'!$C$55:'Obrazac B2'!$C$58,1,FALSE)),A82,\"\")","v":"Detergenti neionski"},1,{"$f":"IF(F82=0,\"\",COUNTIF($F$2:F82,\">0\"))","v":81},"Detergenti neionski"]
["Detergenti, zbroj anionskih i neionskih",252,"ORG0083-0001","mg/l",{"$f":"IF(ISERROR(VLOOKUP(A83,'Obrazac B2'!$C$55:'Obrazac B2'!$C$58,1,FALSE)),A83,\"\")","v":"Detergenti, zbroj anionskih i neionskih"},1,{"$f":"IF(F83=0,\"\",COUNTIF($F$2:F83,\">0\"))","v":82},"Detergenti, zbroj anionskih i neionskih"]
["Di(2-etilheksil)ftalat) (DEHP)",254,"ORG0084-0002","mg/l",{"$f":"IF(ISERROR(VLOOKUP(A84,'Obrazac B2'!$C$55:'Obrazac B2'!$C$58,1,FALSE)),A84,\"\")","v":"Di(2-etilheksil)ftalat) (DEHP)"},1,{"$f":"IF(F84=0,\"\",COUNTIF($F$2:F84,\">0\"))","v":83},"Di(2-etilheksil)ftalat) (DEHP)"]
["Dibromklormetan",258,"ORG0086-0002","mg/l",{"$f":"IF(ISERROR(VLOOKUP(A85,'Obrazac B2'!$C$55:'Obrazac B2'!$C$58,1,FALSE)),A85,\"\")","v":"Dibromklormetan"},1,{"$f":"IF(F85=0,\"\",COUNTIF($F$2:F85,\">0\"))","v":84},"Dibromklormetan"]
["Dieldrin",261,"ORG0087-0002","mg/l",{"$f":"IF(ISERROR(VLOOKUP(A86,'Obrazac B2'!$C$55:'Obrazac B2'!$C$58,1,FALSE)),A86,\"\")","v":"Dieldrin"},1,{"$f":"IF(F86=0,\"\",COUNTIF($F$2:F86,\">0\"))","v":85},"Dieldrin"]
["Diklorbenzen",267,"ORG0092-0001","mg/l",{"$f":"IF(ISERROR(VLOOKUP(A87,'Obrazac B2'!$C$55:'Obrazac B2'!$C$58,1,FALSE)),A87,\"\")","v":"Diklorbenzen"},1,{"$f":"IF(F87=0,\"\",COUNTIF($F$2:F87,\">0\"))","v":86},"Diklorbenzen"]
["Diklormetan",269,"ORG0093-0002","mg/l",{"$f":"IF(ISERROR(VLOOKUP(A88,'Obrazac B2'!$C$55:'Obrazac B2'!$C$58,1,FALSE)),A88,\"\")","v":"Diklormetan"},1,{"$f":"IF(F88=0,\"\",COUNTIF($F$2:F88,\">0\"))","v":87},"Diklormetan"]
["Diklorvos",272,"ORG0094-0002","mg/l",{"$f":"IF(ISERROR(VLOOKUP(A89,'Obrazac B2'!$C$55:'Obrazac B2'!$C$58,1,FALSE)),A89,\"\")","v":"Diklorvos"},1,{"$f":"IF(F89=0,\"\",COUNTIF($F$2:F89,\">0\"))","v":88},"Diklorvos"]
["Dikofol",275,"ORG0095-0002","mg/l",{"$f":"IF(ISERROR(VLOOKUP(A90,'Obrazac B2'!$C$55:'Obrazac B2'!$C$58,1,FALSE)),A90,\"\")","v":"Dikofol"},1,{"$f":"IF(F90=0,\"\",COUNTIF($F$2:F90,\">0\"))","v":89},"Dikofol"]
["Dioksini i furani",279,"ORG0098-0001","ng/l",{"$f":"IF(ISERROR(VLOOKUP(A91,'Obrazac B2'!$C$55:'Obrazac B2'!$C$58,1,FALSE)),A91,\"\")","v":"Dioksini i furani"},1,{"$f":"IF(F91=0,\"\",COUNTIF($F$2:F91,\">0\"))","v":90},"Dioksini i furani"]
["Diuron",283,"ORG0100-0002","mg/l",{"$f":"IF(ISERROR(VLOOKUP(A92,'Obrazac B2'!$C$55:'Obrazac B2'!$C$58,1,FALSE)),A92,\"\")","v":"Diuron"},1,{"$f":"IF(F92=0,\"\",COUNTIF($F$2:F92,\">0\"))","v":91},"Diuron"]
["Ekotoksičnost na dafnije LIDD",286,"EKO0002-0001","faktor razrjeđenja",{"$f":"IF(ISERROR(VLOOKUP(A93,'Obrazac B2'!$C$55:'Obrazac B2'!$C$58,1,FALSE)),A93,\"\")","v":"Ekotoksičnost na dafnije LIDD"},1,{"$f":"IF(F93=0,\"\",COUNTIF($F$2:F93,\">0\"))","v":92},"Ekotoksičnost na dafnije LIDD"]
["Ekotoksičnost na morske alge LIDA",287,"EKO0002-0002","faktor razrjeđenja",{"$f":"IF(ISERROR(VLOOKUP(A94,'Obrazac B2'!$C$55:'Obrazac B2'!$C$58,1,FALSE)),A94,\"\")","v":"Ekotoksičnost na morske alge LIDA"},1,{"$f":"IF(F94=0,\"\",COUNTIF($F$2:F94,\">0\"))","v":93},"Ekotoksičnost na morske alge LIDA"]
["Ekotoksičnost na svjetleće bakterije LIDL",288,"EKO0002-0003","faktor razrjeđenja",{"$f":"IF(ISERROR(VLOOKUP(A95,'Obrazac B2'!$C$55:'Obrazac B2'!$C$58,1,FALSE)),A95,\"\")","v":"Ekotoksičnost na svjetleće bakterije LIDL"},1,{"$f":"IF(F95=0,\"\",COUNTIF($F$2:F95,\">0\"))","v":94},"Ekotoksičnost na svjetleće bakterije LIDL"]
["Električna vodljivost pri 25°C",290,"FKP0004-0002","µS/cm",{"$f":"IF(ISERROR(VLOOKUP(A96,'Obrazac B2'!$C$55:'Obrazac B2'!$C$58,1,FALSE)),A96,\"\")","v":"Električna vodljivost pri 25°C"},1,{"$f":"IF(F96=0,\"\",COUNTIF($F$2:F96,\">0\"))","v":95},"Električna vodljivost pri 25°C"]
["Endosulfan ukupni",293,"ORG0101-0003","mg/l",{"$f":"IF(ISERROR(VLOOKUP(A97,'Obrazac B2'!$C$55:'Obrazac B2'!$C$58,1,FALSE)),A97,\"\")","v":"Endosulfan ukupni"},1,{"$f":"IF(F97=0,\"\",COUNTIF($F$2:F97,\">0\"))","v":96},"Endosulfan ukupni"]
["Endrin",296,"ORG0102-0002","mg/l",{"$f":"IF(ISERROR(VLOOKUP(A98,'Obrazac B2'!$C$55:'Obrazac B2'!$C$58,1,FALSE)),A98,\"\")","v":"Endrin"},1,{"$f":"IF(F98=0,\"\",COUNTIF($F$2:F98,\">0\"))","v":97},"Endrin"]
["Eritromicin",303,"ORG0105-0002","mg/l",{"$f":"IF(ISERROR(VLOOKUP(A99,'Obrazac B2'!$C$55:'Obrazac B2'!$C$58,1,FALSE)),A99,\"\")","v":"Eritromicin"},1,{"$f":"IF(F99=0,\"\",COUNTIF($F$2:F99,\">0\"))","v":98},"Eritromicin"]
["Escherichia coli ",304,"MBP0010-0001","broj/100 ml",{"$f":"IF(ISERROR(VLOOKUP(A100,'Obrazac B2'!$C$55:'Obrazac B2'!$C$58,1,FALSE)),A100,\"\")","v":"Escherichia coli "},1,{"$f":"IF(F100=0,\"\",COUNTIF($F$2:F100,\">0\"))","v":99},"Escherichia coli "]
["Etilbenzen ",309,"ORG0108-0001","mg/l",{"$f":"IF(ISERROR(VLOOKUP(A101,'Obrazac B2'!$C$55:'Obrazac B2'!$C$58,1,FALSE)),A101,\"\")","v":"Etilbenzen "},1,{"$f":"IF(F101=0,\"\",COUNTIF($F$2:F101,\">0\"))","v":100},"Etilbenzen "]
["Fenitrotion",316,"ORG0114-0002","mg/l",{"$f":"IF(ISERROR(VLOOKUP(A102,'Obrazac B2'!$C$55:'Obrazac B2'!$C$58,1,FALSE)),A102,\"\")","v":"Fenitrotion"},1,{"$f":"IF(F102=0,\"\",COUNTIF($F$2:F102,\">0\"))","v":101},"Fenitrotion"]
["Fenoli ukupni",319,"ORG0116-0002","mg/l",{"$f":"IF(ISERROR(VLOOKUP(A103,'Obrazac B2'!$C$55:'Obrazac B2'!$C$58,1,FALSE)),A103,\"\")","v":"Fenoli ukupni"},1,{"$f":"IF(F103=0,\"\",COUNTIF($F$2:F103,\">0\"))","v":102},"Fenoli ukupni"]
["Fention",322,"ORG0117-0002","mg/l",{"$f":"IF(ISERROR(VLOOKUP(A104,'Obrazac B2'!$C$55:'Obrazac B2'!$C$58,1,FALSE)),A104,\"\")","v":"Fention"},1,{"$f":"IF(F104=0,\"\",COUNTIF($F$2:F104,\">0\"))","v":103},"Fention"]
["Fluoranten",327,"ORG0121-0002","mg/l",{"$f":"IF(ISERROR(VLOOKUP(A105,'Obrazac B2'!$C$55:'Obrazac B2'!$C$58,1,FALSE)),A105,\"\")","v":"Fluoranten"},1,{"$f":"IF(F105=0,\"\",COUNTIF($F$2:F105,\">0\"))","v":104},"Fluoranten"]
["Fluoridi",329,"ION0004-0001","mg/l",{"$f":"IF(ISERROR(VLOOKUP(A106,'Obrazac B2'!$C$55:'Obrazac B2'!$C$58,1,FALSE)),A106,\"\")","v":"Fluoridi"},1,{"$f":"IF(F106=0,\"\",COUNTIF($F$2:F106,\">0\"))","v":105},"Fluoridi"]
["Formalaldehid",334,"ORG0126-0001","mg/l",{"$f":"IF(ISERROR(VLOOKUP(A107,'Obrazac B2'!$C$55:'Obrazac B2'!$C$58,1,FALSE)),A107,\"\")","v":"Formalaldehid"},1,{"$f":"IF(F107=0,\"\",COUNTIF($F$2:F107,\">0\"))","v":106},"Formalaldehid"]
["Genotoksičnost LIDEU",338,"EKO0003-0001","faktor razrjeđenja",{"$f":"IF(ISERROR(VLOOKUP(A108,'Obrazac B2'!$C$55:'Obrazac B2'!$C$58,1,FALSE)),A108,\"\")","v":"Genotoksičnost LIDEU"},1,{"$f":"IF(F108=0,\"\",COUNTIF($F$2:F108,\">0\"))","v":107},"Genotoksičnost LIDEU"]
["Heksabromobifenil",341,"ORG0131-0001","mg/l",{"$f":"IF(ISERROR(VLOOKUP(A109,'Obrazac B2'!$C$55:'Obrazac B2'!$C$58,1,FALSE)),A109,\"\")","v":"Heksabromobifenil"},1,{"$f":"IF(F109=0,\"\",COUNTIF($F$2:F109,\">0\"))","v":108},"Heksabromobifenil"]
["Heksabromociklododekan (HBCDD)",342,"ORG0132-0001","mg/l",{"$f":"IF(ISERROR(VLOOKUP(A110,'Obrazac B2'!$C$55:'Obrazac B2'!$C$58,1,FALSE)),A110,\"\")","v":"Heksabromociklododekan (HBCDD)"},1,{"$f":"IF(F110=0,\"\",COUNTIF($F$2:F110,\">0\"))","v":109},"Heksabromociklododekan (HBCDD)"]
["Heksaklorbenzen (HCB)",346,"ORG0134-0002","mg/l",{"$f":"IF(ISERROR(VLOOKUP(A111,'Obrazac B2'!$C$55:'Obrazac B2'!$C$58,1,FALSE)),A111,\"\")","v":"Heksaklorbenzen (HCB)"},1,{"$f":"IF(F111=0,\"\",COUNTIF($F$2:F111,\">0\"))","v":110},"Heksaklorbenzen (HCB)"]
["Heksaklorbutadien",349,"ORG0135-0002","mg/l",{"$f":"IF(ISERROR(VLOOKUP(A112,'Obrazac B2'!$C$55:'Obrazac B2'!$C$58,1,FALSE)),A112,\"\")","v":"Heksaklorbutadien"},1,{"$f":"IF(F112=0,\"\",COUNTIF($F$2:F112,\">0\"))","v":111},"Heksaklorbutadien"]
["Heksaklorcikloheksan ukupni (HCH)",352,"ORG0136-0002","mg/l",{"$f":"IF(ISERROR(VLOOKUP(A113,'Obrazac B2'!$C$55:'Obrazac B2'!$C$58,1,FALSE)),A113,\"\")","v":"Heksaklorcikloheksan ukupni (HCH)"},1,{"$f":"IF(F113=0,\"\",COUNTIF($F$2:F113,\">0\"))","v":112},"Heksaklorcikloheksan ukupni (HCH)"]
["Heptaklor",356,"ORG0137-0002","mg/l",{"$f":"IF(ISERROR(VLOOKUP(A114,'Obrazac B2'!$C$55:'Obrazac B2'!$C$58,1,FALSE)),A114,\"\")","v":"Heptaklor"},1,{"$f":"IF(F114=0,\"\",COUNTIF($F$2:F114,\">0\"))","v":113},"Heptaklor"]
["Heptaklorepoksid",359,"ORG0138-0002","mg/l",{"$f":"IF(ISERROR(VLOOKUP(A115,'Obrazac B2'!$C$55:'Obrazac B2'!$C$58,1,FALSE)),A115,\"\")","v":"Heptaklorepoksid"},1,{"$f":"IF(F115=0,\"\",COUNTIF($F$2:F115,\">0\"))","v":114},"Heptaklorepoksid"]
["Indeno(1,2,3-cd)piren",365,"ORG0141-0002","mg/l",{"$f":"IF(ISERROR(VLOOKUP(A116,'Obrazac B2'!$C$55:'Obrazac B2'!$C$58,1,FALSE)),A116,\"\")","v":"Indeno(1,2,3-cd)piren"},1,{"$f":"IF(F116=0,\"\",COUNTIF($F$2:F116,\">0\"))","v":115},"Indeno(1,2,3-cd)piren"]
["Izodrin",368,"ORG0142-0002","mg/l",{"$f":"IF(ISERROR(VLOOKUP(A117,'Obrazac B2'!$C$55:'Obrazac B2'!$C$58,1,FALSE)),A117,\"\")","v":"Izodrin"},1,{"$f":"IF(F117=0,\"\",COUNTIF($F$2:F117,\">0\"))","v":116},"Izodrin"]
["Izoproturon",372,"ORG0144-0002","mg/l",{"$f":"IF(ISERROR(VLOOKUP(A118,'Obrazac B2'!$C$55:'Obrazac B2'!$C$58,1,FALSE)),A118,\"\")","v":"Izoproturon"},1,{"$f":"IF(F118=0,\"\",COUNTIF($F$2:F118,\">0\"))","v":117},"Izoproturon"]
["Kadmij otopljeni",375,"MET0009-0002","mg/l",{"$f":"IF(ISERROR(VLOOKUP(A119,'Obrazac B2'!$C$55:'Obrazac B2'!$C$58,1,FALSE)),A119,\"\")","v":"Kadmij otopljeni"},1,{"$f":"IF(F119=0,\"\",COUNTIF($F$2:F119,\">0\"))","v":118},"Kadmij otopljeni"]
["Kadmij ukupni",377,"MET0009-0004","mg/l",{"$f":"IF(ISERROR(VLOOKUP(A120,'Obrazac B2'!$C$55:'Obrazac B2'!$C$58,1,FALSE)),A120,\"\")","v":"Kadmij ukupni"},1,{"$f":"IF(F120=0,\"\",COUNTIF($F$2:F120,\">0\"))","v":119},"Kadmij ukupni"]
["Kjeldahl dušik",383,"HRT0003-0001","mgN/l",{"$f":"IF(ISERROR(VLOOKUP(A121,'Obrazac B2'!$C$55:'Obrazac B2'!$C$58,1,FALSE)),A121,\"\")","v":"Kjeldahl dušik"},1,{"$f":"IF(F121=0,\"\",COUNTIF($F$2:F121,\">0\"))","v":120},"Kjeldahl dušik"]
["Klaritromicin",384,"ORG0147-0001","µg/l",{"$f":"IF(ISERROR(VLOOKUP(A122,'Obrazac B2'!$C$55:'Obrazac B2'!$C$58,1,FALSE)),A122,\"\")","v":"Klaritromicin"},1,{"$f":"IF(F122=0,\"\",COUNTIF($F$2:F122,\">0\"))","v":121},"Klaritromicin"]
["Klorfenvinfos",389,"ORG0150-0002","mg/l",{"$f":"IF(ISERROR(VLOOKUP(A123,'Obrazac B2'!$C$55:'Obrazac B2'!$C$58,1,FALSE)),A123,\"\")","v":"Klorfenvinfos"},1,{"$f":"IF(F123=0,\"\",COUNTIF($F$2:F123,\">0\"))","v":122},"Klorfenvinfos"]
["Kloridi",391,"ION0009-0001","mg/l",{"$f":"IF(ISERROR(VLOOKUP(A124,'Obrazac B2'!$C$55:'Obrazac B2'!$C$58,1,FALSE)),A124,\"\")","v":"Kloridi"},1,{"$f":"IF(F124=0,\"\",COUNTIF($F$2:F124,\">0\"))","v":123},"Kloridi"]
["Klorpirifos (-etil)",398,"ORG0152-0002","mg/l",{"$f":"IF(ISERROR(VLOOKUP(A125,'Obrazac B2'!$C$55:'Obrazac B2'!$C$58,1,FALSE)),A125,\"\")","v":"Klorpirifos (-etil)"},1,{"$f":"IF(F125=0,\"\",COUNTIF($F$2:F125,\">0\"))","v":124},"Klorpirifos (-etil)"]
["Kobalt otopljeni",404,"MET0010-0002","mg/l",{"$f":"IF(ISERROR(VLOOKUP(A126,'Obrazac B2'!$C$55:'Obrazac B2'!$C$58,1,FALSE)),A126,\"\")","v":"Kobalt otopljeni"},1,{"$f":"IF(F126=0,\"\",COUNTIF($F$2:F126,\">0\"))","v":125},"Kobalt otopljeni"]
["Kobalt ukupni",406,"MET0010-0004","mg/l",{"$f":"IF(ISERROR(VLOOKUP(A127,'Obrazac B2'!$C$55:'Obrazac B2'!$C$58,1,FALSE)),A127,\"\")","v":"Kobalt ukupni"},1,{"$f":"IF(F127=0,\"\",COUNTIF($F$2:F127,\">0\"))","v":126},"Kobalt ukupni"]
["Kositar otopljeni",409,"MET0011-0002","mg/l",{"$f":"IF(ISERROR(VLOOKUP(A128,'Obrazac B2'!$C$55:'Obrazac B2'!$C$58,1,FALSE)),A128,\"\")","v":"Kositar otopljeni"},1,{"$f":"IF(F128=0,\"\",COUNTIF($F$2:F128,\">0\"))","v":127},"Kositar otopljeni"]
["Kositar ukupni",411,"MET0011-0004","mg/l",{"$f":"IF(ISERROR(VLOOKUP(A129,'Obrazac B2'!$C$55:'Obrazac B2'!$C$58,1,FALSE)),A129,\"\")","v":"Kositar ukupni"},1,{"$f":"IF(F129=0,\"\",COUNTIF($F$2:F129,\">0\"))","v":128},"Kositar ukupni"]
["KPKCr teret",413,"TER0001-0002","kg/t proizv/sirovine",{"$f":"IF(ISERROR(VLOOKUP(A130,'Obrazac B2'!$C$55:'Obrazac B2'!$C$58,1,FALSE)),A130,\"\")","v":"KPKCr teret"},1,{"$f":"IF(F130=0,\"\",COUNTIF($F$2:F130,\">0\"))","v":129},{"$f":"IFERROR(INDEX(E:E,MATCH(ROW(F129),G:G,0)),\"\")","v":"KPKCr teret"}]
["KPK-Mn",414,"REK0003-0001","mgO₂/l",{"$f":"IF(ISERROR(VLOOKUP(A131,'Obrazac B2'!$C$55:'Obrazac B2'!$C$58,1,FALSE)),A131,\"\")","v":"KPK-Mn"},1,{"$f":"IF(F131=0,\"\",COUNTIF($F$2:F131,\">0\"))","v":130},"KPK-Mn"]
["Krom 3+",415,"MET0013-0001","mg/l",{"$f":"IF(ISERROR(VLOOKUP(A132,'Obrazac B2'!$C$55:'Obrazac B2'!$C$58,1,FALSE)),A132,\"\")","v":"Krom 3+"},{"$f":"IFERROR(SEARCH(INDIRECT(CELL(\"address\")),E132),0)","v":1},{"$f":"IF(F132=0,\"\",COUNTIF($F$2:F132,\">0\"))","v":131},"Krom 3+"]
["Krom 6+",416,"MET0014-0001","mg/l",{"$f":"IF(ISERROR(VLOOKUP(A133,'Obrazac B2'!$C$55:'Obrazac B2'!$C$58,1,FALSE)),A133,\"\")","v":"Krom 6+"},1,{"$f":"IF(F133=0,\"\",COUNTIF($F$2:F133,\">0\"))","v":132},"Krom 6+"]
["Krom otopljeni",418,"MET0012-0002","mg/l",{"$f":"IF(ISERROR(VLOOKUP(A134,'Obrazac B2'!$C$55:'Obrazac B2'!$C$58,1,FALSE)),A134,\"\")","v":"Krom otopljeni"},1,{"$f":"IF(F134=0,\"\",COUNTIF($F$2:F134,\">0\"))","v":133},"Krom otopljeni"]
["Krom ukupni",420,"MET0012-0004","mg/l",{"$f":"IF(ISERROR(VLOOKUP(A135,'Obrazac B2'!$C$55:'Obrazac B2'!$C$58,1,FALSE)),A135,\"\")","v":"Krom ukupni"},1,{"$f":"IF(F135=0,\"\",COUNTIF($F$2:F135,\">0\"))","v":134},"Krom ukupni"]
["Ksilen ukupni",424,"ORG0156-0002","mg/l",{"$f":"IF(ISERROR(VLOOKUP(A136,'Obrazac B2'!$C$55:'Obrazac B2'!$C$58,1,FALSE)),A136,\"\")","v":"Ksilen ukupni"},1,{"$f":"IF(F136=0,\"\",COUNTIF($F$2:F136,\">0\"))","v":135},"Ksilen ukupni"]
["Kvinoksifen",428,"ORG0158-0002","mg/l",{"$f":"IF(ISERROR(VLOOKUP(A137,'Obrazac B2'!$C$55:'Obrazac B2'!$C$58,1,FALSE)),A137,\"\")","v":"Kvinoksifen"},1,{"$f":"IF(F137=0,\"\",COUNTIF($F$2:F137,\">0\"))","v":136},"Kvinoksifen"]
["Lakohlapljivi aromatski ugljikovodici (BTEX)",430,"ORG0159-0001","mg/l",{"$f":"IF(ISERROR(VLOOKUP(A138,'Obrazac B2'!$C$55:'Obrazac B2'!$C$58,1,FALSE)),A138,\"\")","v":"Lakohlapljivi aromatski ugljikovodici (BTEX)"},1,{"$f":"IF(F138=0,\"\",COUNTIF($F$2:F138,\">0\"))","v":137},"Lakohlapljivi aromatski ugljikovodici (BTEX)"]
["Levotiroksin natrij hidrat",1195,"ORG0347-0001","µg/l",{"$f":"IF(ISERROR(VLOOKUP(A139,'Obrazac B2'!$C$55:'Obrazac B2'!$C$58,1,FALSE)),A139,\"\")","v":"Levotiroksin natrij hidrat"},{"$f":"IFERROR(SEARCH(INDIRECT(CELL(\"address\")),E139),0)","v":1},{"$f":"IF(F139=0,\"\",COUNTIF($F$2:F139,\">0\"))","v":138},"Levotiroksin natrij hidrat"]
["Litij otopljeni",433,"MET0015-0002","mg/l",{"$f":"IF(ISERROR(VLOOKUP(A140,'Obrazac B2'!$C$55:'Obrazac B2'!$C$58,1,FALSE)),A140,\"\")","v":"Litij otopljeni"},1,{"$f":"IF(F140=0,\"\",COUNTIF($F$2:F140,\">0\"))","v":139},"Litij otopljeni"]
["Litij ukupni",434,"MET0015-0003","mg/l",{"$f":"IF(ISERROR(VLOOKUP(A141,'Obrazac B2'!$C$55:'Obrazac B2'!$C$58,1,FALSE)),A141,\"\")","v":"Litij ukupni"},1,{"$f":"IF(F141=0,\"\",COUNTIF($F$2:F141,\">0\"))","v":140},"Litij ukupni"]
["Magnezij",435,"ION0012-0001","mg/l",{"$f":"IF(ISERROR(VLOOKUP(A142,'Obrazac B2'!$C$55:'Obrazac B2'!$C$58,1,FALSE)),A142,\"\")","v":"Magnezij"},1,{"$f":"IF(F142=0,\"\",COUNTIF($F$2:F142,\">0\"))","v":141},"Magnezij"]
["Malation",437,"ORG0161-0002","mg/l",{"$f":"IF(ISERROR(VLOOKUP(A143,'Obrazac B2'!$C$55:'Obrazac B2'!$C$58,1,FALSE)),A143,\"\")","v":"Malation"},1,{"$f":"IF(F143=0,\"\",COUNTIF($F$2:F143,\">0\"))","v":142},"Malation"]
["Mangan otopljeni",439,"MET0016-0002","mg/l",{"$f":"IF(ISERROR(VLOOKUP(A144,'Obrazac B2'!$C$55:'Obrazac B2'!$C$58,1,FALSE)),A144,\"\")","v":"Mangan otopljeni"},1,{"$f":"IF(F144=0,\"\",COUNTIF($F$2:F144,\">0\"))","v":143},"Mangan otopljeni"]
["Mangan ukupni",441,"MET0016-0004","mg/l",{"$f":"IF(ISERROR(VLOOKUP(A145,'Obrazac B2'!$C$55:'Obrazac B2'!$C$58,1,FALSE)),A145,\"\")","v":"Mangan ukupni"},1,{"$f":"IF(F145=0,\"\",COUNTIF($F$2:F145,\">0\"))","v":144},"Mangan ukupni"]
["Memantin",922,"ORG0313-0001","µg/l",{"$f":"IF(ISERROR(VLOOKUP(A146,'Obrazac B2'!$C$55:'Obrazac B2'!$C$58,1,FALSE)),A146,\"\")","v":"Memantin"},{"$f":"IFERROR(SEARCH(INDIRECT(CELL(\"address\")),E146),0)","v":1},{"$f":"IF(F146=0,\"\",COUNTIF($F$2:F146,\">0\"))","v":145},"Memantin"]
["Metionin, DL-",1194,"ORG0346-0001","µg/l",{"$f":"IF(ISERROR(VLOOKUP(A147,'Obrazac B2'!$C$55:'Obrazac B2'!$C$58,1,FALSE)),A147,\"\")","v":"Metionin, DL-"},1,{"$f":"IF(F147=0,\"\",COUNTIF($F$2:F147,\">0\"))","v":146},"Metionin, DL-"]
["Metoksiklor",453,"ORG0171-0002","mg/l",{"$f":"IF(ISERROR(VLOOKUP(A148,'Obrazac B2'!$C$55:'Obrazac B2'!$C$58,1,FALSE)),A148,\"\")","v":"Metoksiklor"},1,{"$f":"IF(F148=0,\"\",COUNTIF($F$2:F148,\">0\"))","v":147},"Metoksiklor"]
["m-ksilen",464,"ORG0178-0002","mg/l",{"$f":"IF(ISERROR(VLOOKUP(A149,'Obrazac B2'!$C$55:'Obrazac B2'!$C$58,1,FALSE)),A149,\"\")","v":"m-ksilen"},1,{"$f":"IF(F149=0,\"\",COUNTIF($F$2:F149,\">0\"))","v":148},"m-ksilen"]
["m-ksilen+p-ksilen",467,"ORG0179-0002","mg/l",{"$f":"IF(ISERROR(VLOOKUP(A150,'Obrazac B2'!$C$55:'Obrazac B2'!$C$58,1,FALSE)),A150,\"\")","v":"m-ksilen+p-ksilen"},1,{"$f":"IF(F150=0,\"\",COUNTIF($F$2:F150,\">0\"))","v":149},"m-ksilen+p-ksilen"]
["Molibden otopljeni",469,"MET0017-0002","mg/l",{"$f":"IF(ISERROR(VLOOKUP(A151,'Obrazac B2'!$C$55:'Obrazac B2'!$C$58,1,FALSE)),A151,\"\")","v":"Molibden otopljeni"},1,{"$f":"IF(F151=0,\"\",COUNTIF($F$2:F151,\">0\"))","v":150},"Molibden otopljeni"]
["Molibden ukupni",470,"MET0017-0003","mg/l",{"$f":"IF(ISERROR(VLOOKUP(A152,'Obrazac B2'!$C$55:'Obrazac B2'!$C$58,1,FALSE)),A152,\"\")","v":"Molibden ukupni"},1,{"$f":"IF(F152=0,\"\",COUNTIF($F$2:F152,\">0\"))","v":151},"Molibden ukupni"]
["Mulj",471,"FKP0007-0001","nema",{"$f":"IF(ISERROR(VLOOKUP(A153,'Obrazac B2'!$C$55:'Obrazac B2'!$C$58,1,FALSE)),A153,\"\")","v":"Mulj"},1,{"$f":"IF(F153=0,\"\",COUNTIF($F$2:F153,\">0\"))","v":152},"Mulj"]
["Naftalen",475,"ORG0180-0002","mg/l",{"$f":"IF(ISERROR(VLOOKUP(A154,'Obrazac B2'!$C$55:'Obrazac B2'!$C$58,1,FALSE)),A154,\"\")","v":"Naftalen"},1,{"$f":"IF(F154=0,\"\",COUNTIF($F$2:F154,\">0\"))","v":153},"Naftalen"]
["Natrij",477,"ION0013-0001","mg/l",{"$f":"IF(ISERROR(VLOOKUP(A155,'Obrazac B2'!$C$55:'Obrazac B2'!$C$58,1,FALSE)),A155,\"\")","v":"Natrij"},1,{"$f":"IF(F155=0,\"\",COUNTIF($F$2:F155,\">0\"))","v":154},"Natrij"]
["Nikal otopljeni",480,"MET0018-0002","mg/l",{"$f":"IF(ISERROR(VLOOKUP(A156,'Obrazac B2'!$C$55:'Obrazac B2'!$C$58,1,FALSE)),A156,\"\")","v":"Nikal otopljeni"},1,{"$f":"IF(F156=0,\"\",COUNTIF($F$2:F156,\">0\"))","v":155},"Nikal otopljeni"]
["Nikal ukupni",482,"MET0018-0004","mg/l",{"$f":"IF(ISERROR(VLOOKUP(A157,'Obrazac B2'!$C$55:'Obrazac B2'!$C$58,1,FALSE)),A157,\"\")","v":"Nikal ukupni"},1,{"$f":"IF(F157=0,\"\",COUNTIF($F$2:F157,\">0\"))","v":156},"Nikal ukupni"]
["Nitrati",485,"HRT0005-0001","mgN/l",{"$f":"IF(ISERROR(VLOOKUP(A158,'Obrazac B2'!$C$55:'Obrazac B2'!$C$58,1,FALSE)),A158,\"\")","v":"Nitrati"},1,{"$f":"IF(F158=0,\"\",COUNTIF($F$2:F158,\">0\"))","v":157},"Nitrati"]
["Nitriti",489,"HRT0006-0002","mgN/l",{"$f":"IF(ISERROR(VLOOKUP(A159,'Obrazac B2'!$C$55:'Obrazac B2'!$C$58,1,FALSE)),A159,\"\")","v":"Nitriti"},1,{"$f":"IF(F159=0,\"\",COUNTIF($F$2:F159,\">0\"))","v":158},"Nitriti"]
["N-nitrozodibutilamin",492,"ORG0182-0001","mg/l",{"$f":"IF(ISERROR(VLOOKUP(A160,'Obrazac B2'!$C$55:'Obrazac B2'!$C$58,1,FALSE)),A160,\"\")","v":"N-nitrozodibutilamin"},1,{"$f":"IF(F160=0,\"\",COUNTIF($F$2:F160,\">0\"))","v":159},"N-nitrozodibutilamin"]
["Nonilfenol",494,"ORG0183-0002","mg/l",{"$f":"IF(ISERROR(VLOOKUP(A161,'Obrazac B2'!$C$55:'Obrazac B2'!$C$58,1,FALSE)),A161,\"\")","v":"Nonilfenol"},1,{"$f":"IF(F161=0,\"\",COUNTIF($F$2:F161,\">0\"))","v":160},"Nonilfenol"]
["Nonilfenol i etoksilati (NP/NPE), smjesa izomera",496,"ORG0183-0004","mg/l",{"$f":"IF(ISERROR(VLOOKUP(A162,'Obrazac B2'!$C$55:'Obrazac B2'!$C$58,1,FALSE)),A162,\"\")","v":"Nonilfenol i etoksilati (NP/NPE), smjesa izomera"},1,{"$f":"IF(F162=0,\"\",COUNTIF($F$2:F162,\">0\"))","v":161},"Nonilfenol i etoksilati (NP/NPE), smjesa izomera"]
["o-ksilen",544,"ORG0187-0002","mg/l",{"$f":"IF(ISERROR(VLOOKUP(A163,'Obrazac B2'!$C$55:'Obrazac B2'!$C$58,1,FALSE)),A163,\"\")","v":"o-ksilen"},1,{"$f":"IF(F163=0,\"\",COUNTIF($F$2:F163,\">0\"))","v":162},"o-ksilen"]
["Oksitetraciklin hidroklorid",546,"ORG0188-0001","mg/l",{"$f":"IF(ISERROR(VLOOKUP(A164,'Obrazac B2'!$C$55:'Obrazac B2'!$C$58,1,FALSE)),A164,\"\")","v":"Oksitetraciklin hidroklorid"},1,{"$f":"IF(F164=0,\"\",COUNTIF($F$2:F164,\">0\"))","v":163},"Oksitetraciklin hidroklorid"]
["Oktilfenoli i oktilfenol etoksilati   ",549,"ORG0190-0001","mg/l",{"$f":"IF(ISERROR(VLOOKUP(A165,'Obrazac B2'!$C$55:'Obrazac B2'!$C$58,1,FALSE)),A165,\"\")","v":"Oktilfenoli i oktilfenol etoksilati   "},1,{"$f":"IF(F165=0,\"\",COUNTIF($F$2:F165,\">0\"))","v":164},"Oktilfenoli i oktilfenol etoksilati   "]
["Olovo otopljeno",552,"MET0019-0002","mg/l",{"$f":"IF(ISERROR(VLOOKUP(A166,'Obrazac B2'!$C$55:'Obrazac B2'!$C$58,1,FALSE)),A166,\"\")","v":"Olovo otopljeno"},1,{"$f":"IF(F166=0,\"\",COUNTIF($F$2:F166,\">0\"))","v":165},"Olovo otopljeno"]
["Olovo ukupno",554,"MET0019-0004","mg/l",{"$f":"IF(ISERROR(VLOOKUP(A167,'Obrazac B2'!$C$55:'Obrazac B2'!$C$58,1,FALSE)),A167,\"\")","v":"Olovo ukupno"},1,{"$f":"IF(F167=0,\"\",COUNTIF($F$2:F167,\">0\"))","v":166},"Olovo ukupno"]
["Organofosforni pesticidi ukupni",558,"ORG0192-0002","mg/l",{"$f":"IF(ISERROR(VLOOKUP(A168,'Obrazac B2'!$C$55:'Obrazac B2'!$C$58,1,FALSE)),A168,\"\")","v":"Organofosforni pesticidi ukupni"},1,{"$f":"IF(F168=0,\"\",COUNTIF($F$2:F168,\">0\"))","v":167},"Organofosforni pesticidi ukupni"]
["Organoklorovi pesticidi ukupni",561,"ORG0193-0002","mg/l",{"$f":"IF(ISERROR(VLOOKUP(A169,'Obrazac B2'!$C$55:'Obrazac B2'!$C$58,1,FALSE)),A169,\"\")","v":"Organoklorovi pesticidi ukupni"},1,{"$f":"IF(F169=0,\"\",COUNTIF($F$2:F169,\">0\"))","v":168},"Organoklorovi pesticidi ukupni"]
["Organski dušik",563,"HRT0007-0001","mgN/l",{"$f":"IF(ISERROR(VLOOKUP(A170,'Obrazac B2'!$C$55:'Obrazac B2'!$C$58,1,FALSE)),A170,\"\")","v":"Organski dušik"},1,{"$f":"IF(F170=0,\"\",COUNTIF($F$2:F170,\">0\"))","v":169},"Organski dušik"]
["Ortofosfati otopljeni",564,"HRT0008-0001","mgP/l",{"$f":"IF(ISERROR(VLOOKUP(A171,'Obrazac B2'!$C$55:'Obrazac B2'!$C$58,1,FALSE)),A171,\"\")","v":"Ortofosfati otopljeni"},1,{"$f":"IF(F171=0,\"\",COUNTIF($F$2:F171,\">0\"))","v":170},"Ortofosfati otopljeni"]
["Otopljeni organski ugljik (DOC)",569,"HRT0009-0001","mgC/l",{"$f":"IF(ISERROR(VLOOKUP(A172,'Obrazac B2'!$C$55:'Obrazac B2'!$C$58,1,FALSE)),A172,\"\")","v":"Otopljeni organski ugljik (DOC)"},1,{"$f":"IF(F172=0,\"\",COUNTIF($F$2:F172,\">0\"))","v":171},"Otopljeni organski ugljik (DOC)"]
["Paration",573,"ORG0194-0002","mg/l",{"$f":"IF(ISERROR(VLOOKUP(A173,'Obrazac B2'!$C$55:'Obrazac B2'!$C$58,1,FALSE)),A173,\"\")","v":"Paration"},1,{"$f":"IF(F173=0,\"\",COUNTIF($F$2:F173,\">0\"))","v":172},"Paration"]
["Paration (-metil)",575,"ORG0195-0002","mg/l",{"$f":"IF(ISERROR(VLOOKUP(A174,'Obrazac B2'!$C$55:'Obrazac B2'!$C$58,1,FALSE)),A174,\"\")","v":"Paration (-metil)"},1,{"$f":"IF(F174=0,\"\",COUNTIF($F$2:F174,\">0\"))","v":173},"Paration (-metil)"]
["PBDE 100",582,"ORG0196-0002","mg/l",{"$f":"IF(ISERROR(VLOOKUP(A175,'Obrazac B2'!$C$55:'Obrazac B2'!$C$58,1,FALSE)),A175,\"\")","v":"PBDE 100"},1,{"$f":"IF(F175=0,\"\",COUNTIF($F$2:F175,\">0\"))","v":174},"PBDE 100"]
["PBDE 153",585,"ORG0197-0002","mg/l",{"$f":"IF(ISERROR(VLOOKUP(A176,'Obrazac B2'!$C$55:'Obrazac B2'!$C$58,1,FALSE)),A176,\"\")","v":"PBDE 153"},1,{"$f":"IF(F176=0,\"\",COUNTIF($F$2:F176,\">0\"))","v":175},"PBDE 153"]
["PBDE 154",588,"ORG0198-0002","mg/l",{"$f":"IF(ISERROR(VLOOKUP(A177,'Obrazac B2'!$C$55:'Obrazac B2'!$C$58,1,FALSE)),A177,\"\")","v":"PBDE 154"},1,{"$f":"IF(F177=0,\"\",COUNTIF($F$2:F177,\">0\"))","v":176},"PBDE 154"]
["PBDE 183",590,"ORG0199-0001","µg/l",{"$f":"IF(ISERROR(VLOOKUP(A178,'Obrazac B2'!$C$55:'Obrazac B2'!$C$58,1,FALSE)),A178,\"\")","v":"PBDE 183"},1,{"$f":"IF(F178=0,\"\",COUNTIF($F$2:F178,\">0\"))","v":177},"PBDE 183"]
["PBDE 28",593,"ORG0200-0002","mg/l",{"$f":"IF(ISERROR(VLOOKUP(A179,'Obrazac B2'!$C$55:'Obrazac B2'!$C$58,1,FALSE)),A179,\"\")","v":"PBDE 28"},1,{"$f":"IF(F179=0,\"\",COUNTIF($F$2:F179,\">0\"))","v":178},"PBDE 28"]
["PBDE 47",596,"ORG0201-0002","mg/l",{"$f":"IF(ISERROR(VLOOKUP(A180,'Obrazac B2'!$C$55:'Obrazac B2'!$C$58,1,FALSE)),A180,\"\")","v":"PBDE 47"},1,{"$f":"IF(F180=0,\"\",COUNTIF($F$2:F180,\">0\"))","v":179},"PBDE 47"]
["PBDE 99",599,"ORG0202-0002","mg/l",{"$f":"IF(ISERROR(VLOOKUP(A181,'Obrazac B2'!$C$55:'Obrazac B2'!$C$58,1,FALSE)),A181,\"\")","v":"PBDE 99"},1,{"$f":"IF(F181=0,\"\",COUNTIF($F$2:F181,\">0\"))","v":180},"PBDE 99"]
["PCB 101",602,"ORG0203-0002","mg/l",{"$f":"IF(ISERROR(VLOOKUP(A182,'Obrazac B2'!$C$55:'Obrazac B2'!$C$58,1,FALSE)),A182,\"\")","v":"PCB 101"},1,{"$f":"IF(F182=0,\"\",COUNTIF($F$2:F182,\">0\"))","v":181},"PCB 101"]
["PCB 105",605,"ORG0204-0002","mg/l",{"$f":"IF(ISERROR(VLOOKUP(A183,'Obrazac B2'!$C$55:'Obrazac B2'!$C$58,1,FALSE)),A183,\"\")","v":"PCB 105"},1,{"$f":"IF(F183=0,\"\",COUNTIF($F$2:F183,\">0\"))","v":182},"PCB 105"]
["PCB 114",608,"ORG0205-0002","mg/l",{"$f":"IF(ISERROR(VLOOKUP(A184,'Obrazac B2'!$C$55:'Obrazac B2'!$C$58,1,FALSE)),A184,\"\")","v":"PCB 114"},1,{"$f":"IF(F184=0,\"\",COUNTIF($F$2:F184,\">0\"))","v":183},"PCB 114"]
["PCB 118",611,"ORG0206-0002","mg/l",{"$f":"IF(ISERROR(VLOOKUP(A185,'Obrazac B2'!$C$55:'Obrazac B2'!$C$58,1,FALSE)),A185,\"\")","v":"PCB 118"},1,{"$f":"IF(F185=0,\"\",COUNTIF($F$2:F185,\">0\"))","v":184},"PCB 118"]
["PCB 123",614,"ORG0207-0002","mg/l",{"$f":"IF(ISERROR(VLOOKUP(A186,'Obrazac B2'!$C$55:'Obrazac B2'!$C$58,1,FALSE)),A186,\"\")","v":"PCB 123"},1,{"$f":"IF(F186=0,\"\",COUNTIF($F$2:F186,\">0\"))","v":185},"PCB 123"]
["PCB 126",617,"ORG0208-0002","mg/l",{"$f":"IF(ISERROR(VLOOKUP(A187,'Obrazac B2'!$C$55:'Obrazac B2'!$C$58,1,FALSE)),A187,\"\")","v":"PCB 126"},1,{"$f":"IF(F187=0,\"\",COUNTIF($F$2:F187,\">0\"))","v":186},"PCB 126"]
["PCB 138",620,"ORG0209-0002","mg/l",{"$f":"IF(ISERROR(VLOOKUP(A188,'Obrazac B2'!$C$55:'Obrazac B2'!$C$58,1,FALSE)),A188,\"\")","v":"PCB 138"},1,{"$f":"IF(F188=0,\"\",COUNTIF($F$2:F188,\">0\"))","v":187},"PCB 138"]
["PCB 153",623,"ORG0210-0002","mg/l",{"$f":"IF(ISERROR(VLOOKUP(A189,'Obrazac B2'!$C$55:'Obrazac B2'!$C$58,1,FALSE)),A189,\"\")","v":"PCB 153"},1,{"$f":"IF(F189=0,\"\",COUNTIF($F$2:F189,\">0\"))","v":188},"PCB 153"]
["PCB 156",626,"ORG0211-0002","mg/l",{"$f":"IF(ISERROR(VLOOKUP(A190,'Obrazac B2'!$C$55:'Obrazac B2'!$C$58,1,FALSE)),A190,\"\")","v":"PCB 156"},1,{"$f":"IF(F190=0,\"\",COUNTIF($F$2:F190,\">0\"))","v":189},"PCB 156"]
["PCB 157",629,"ORG0212-0002","mg/l",{"$f":"IF(ISERROR(VLOOKUP(A191,'Obrazac B2'!$C$55:'Obrazac B2'!$C$58,1,FALSE)),A191,\"\")","v":"PCB 157"},1,{"$f":"IF(F191=0,\"\",COUNTIF($F$2:F191,\">0\"))","v":190},"PCB 157"]
["PCB 167",632,"ORG0213-0002","mg/l",{"$f":"IF(ISERROR(VLOOKUP(A192,'Obrazac B2'!$C$55:'Obrazac B2'!$C$58,1,FALSE)),A192,\"\")","v":"PCB 167"},1,{"$f":"IF(F192=0,\"\",COUNTIF($F$2:F192,\">0\"))","v":191},"PCB 167"]
["PCB 169",635,"ORG0214-0002","mg/l",{"$f":"IF(ISERROR(VLOOKUP(A193,'Obrazac B2'!$C$55:'Obrazac B2'!$C$58,1,FALSE)),A193,\"\")","v":"PCB 169"},1,{"$f":"IF(F193=0,\"\",COUNTIF($F$2:F193,\">0\"))","v":192},"PCB 169"]
["PCB 180",638,"ORG0215-0002","mg/l",{"$f":"IF(ISERROR(VLOOKUP(A194,'Obrazac B2'!$C$55:'Obrazac B2'!$C$58,1,FALSE)),A194,\"\")","v":"PCB 180"},1,{"$f":"IF(F194=0,\"\",COUNTIF($F$2:F194,\">0\"))","v":193},{"$f":"IFERROR(INDEX(E:E,MATCH(ROW(F193),G:G,0)),\"\")","v":"PCB 180"}]
["PCB 189",641,"ORG0216-0002","mg/l",{"$f":"IF(ISERROR(VLOOKUP(A195,'Obrazac B2'!$C$55:'Obrazac B2'!$C$58,1,FALSE)),A195,\"\")","v":"PCB 189"},1,{"$f":"IF(F195=0,\"\",COUNTIF($F$2:F195,\">0\"))","v":194},"PCB 189"]
["PCB 194",643,"ORG0217-0001","mg/l",{"$f":"IF(ISERROR(VLOOKUP(A196,'Obrazac B2'!$C$55:'Obrazac B2'!$C$58,1,FALSE)),A196,\"\")","v":"PCB 194"},1,{"$f":"IF(F196=0,\"\",COUNTIF($F$2:F196,\">0\"))","v":195},"PCB 194"]
["PCB 28",645,"ORG0218-0002","mg/l",{"$f":"IF(ISERROR(VLOOKUP(A197,'Obrazac B2'!$C$55:'Obrazac B2'!$C$58,1,FALSE)),A197,\"\")","v":"PCB 28"},1,{"$f":"IF(F197=0,\"\",COUNTIF($F$2:F197,\">0\"))","v":196},"PCB 28"]
["PCB 52",648,"ORG0219-0002","mg/l",{"$f":"IF(ISERROR(VLOOKUP(A198,'Obrazac B2'!$C$55:'Obrazac B2'!$C$58,1,FALSE)),A198,\"\")","v":"PCB 52"},1,{"$f":"IF(F198=0,\"\",COUNTIF($F$2:F198,\">0\"))","v":197},"PCB 52"]
["PCB 77",651,"ORG0220-0002","mg/l",{"$f":"IF(ISERROR(VLOOKUP(A199,'Obrazac B2'!$C$55:'Obrazac B2'!$C$58,1,FALSE)),A199,\"\")","v":"PCB 77"},{"$f":"IFERROR(SEARCH(INDIRECT(CELL(\"address\")),E199),0)","v":1},{"$f":"IF(F199=0,\"\",COUNTIF($F$2:F199,\">0\"))","v":198},"PCB 77"]
["PCB 81",654,"ORG0221-0002","mg/l",{"$f":"IF(ISERROR(VLOOKUP(A200,'Obrazac B2'!$C$55:'Obrazac B2'!$C$58,1,FALSE)),A200,\"\")","v":"PCB 81"},1,{"$f":"IF(F200=0,\"\",COUNTIF($F$2:F200,\">0\"))","v":199},"PCB 81"]
["Pentaklorbenzen",659,"ORG0224-0002","mg/l",{"$f":"IF(ISERROR(VLOOKUP(A201,'Obrazac B2'!$C$55:'Obrazac B2'!$C$58,1,FALSE)),A201,\"\")","v":"Pentaklorbenzen"},1,{"$f":"IF(F201=0,\"\",COUNTIF($F$2:F201,\">0\"))","v":200},"Pentaklorbenzen"]
["Pentaklorfenol",662,"ORG0225-0002","mg/l",{"$f":"IF(ISERROR(VLOOKUP(A202,'Obrazac B2'!$C$55:'Obrazac B2'!$C$58,1,FALSE)),A202,\"\")","v":"Pentaklorfenol"},1,{"$f":"IF(F202=0,\"\",COUNTIF($F$2:F202,\">0\"))","v":201},"Pentaklorfenol"]
["Pesticidi-staro",668,"ORG0229-0001","mg/l",{"$f":"IF(ISERROR(VLOOKUP(A203,'Obrazac B2'!$C$55:'Obrazac B2'!$C$58,1,FALSE)),A203,\"\")","v":"Pesticidi-staro"},1,{"$f":"IF(F203=0,\"\",COUNTIF($F$2:F203,\">0\"))","v":202},"Pesticidi-staro"]
["Pimobendan",1196,"ORG0348-0001","µg/l",{"$f":"IF(ISERROR(VLOOKUP(A204,'Obrazac B2'!$C$55:'Obrazac B2'!$C$58,1,FALSE)),A204,\"\")","v":"Pimobendan"},{"$f":"IFERROR(SEARCH(INDIRECT(CELL(\"address\")),E204),0)","v":1},{"$f":"IF(F204=0,\"\",COUNTIF($F$2:F204,\">0\"))","v":203},"Pimobendan"]
["p-ksilen",677,"ORG0235-0002","mg/l",{"$f":"IF(ISERROR(VLOOKUP(A205,'Obrazac B2'!$C$55:'Obrazac B2'!$C$58,1,FALSE)),A205,\"\")","v":"p-ksilen"},1,{"$f":"IF(F205=0,\"\",COUNTIF($F$2:F205,\">0\"))","v":204},"p-ksilen"]
["Polibromirani difenileteri (PBDE)",680,"ORG0236-0002","mg/l",{"$f":"IF(ISERROR(VLOOKUP(A206,'Obrazac B2'!$C$55:'Obrazac B2'!$C$58,1,FALSE)),A206,\"\")","v":"Polibromirani difenileteri (PBDE)"},1,{"$f":"IF(F206=0,\"\",COUNTIF($F$2:F206,\">0\"))","v":205},"Polibromirani difenileteri (PBDE)"]
["Policiklički aromatski ugljikovodici (PAH)",683,"ORG0237-0002","mg/l",{"$f":"IF(ISERROR(VLOOKUP(A207,'Obrazac B2'!$C$55:'Obrazac B2'!$C$58,1,FALSE)),A207,\"\")","v":"Policiklički aromatski ugljikovodici (PAH)"},1,{"$f":"IF(F207=0,\"\",COUNTIF($F$2:F207,\">0\"))","v":206},"Policiklički aromatski ugljikovodici (PAH)"]
["Poliklorirani bifenili ukupni (PCB)",685,"ORG0238-0002","mg/l",{"$f":"IF(ISERROR(VLOOKUP(A208,'Obrazac B2'!$C$55:'Obrazac B2'!$C$58,1,FALSE)),A208,\"\")","v":"Poliklorirani bifenili ukupni (PCB)"},1,{"$f":"IF(F208=0,\"\",COUNTIF($F$2:F208,\">0\"))","v":207},"Poliklorirani bifenili ukupni (PCB)"]
["Radioaktivnost alfa ukupna",693,"RAD0001-0001","mBq/l",{"$f":"IF(ISERROR(VLOOKUP(A209,'Obrazac B2'!$C$55:'Obrazac B2'!$C$58,1,FALSE)),A209,\"\")","v":"Radioaktivnost alfa ukupna"},1,{"$f":"IF(F209=0,\"\",COUNTIF($F$2:F209,\">0\"))","v":208},"Radioaktivnost alfa ukupna"]
["Radioaktivnost beta ukupna",694,"RAD0002-0001","mBq/l",{"$f":"IF(ISERROR(VLOOKUP(A210,'Obrazac B2'!$C$55:'Obrazac B2'!$C$58,1,FALSE)),A210,\"\")","v":"Radioaktivnost beta ukupna"},1,{"$f":"IF(F210=0,\"\",COUNTIF($F$2:F210,\">0\"))","v":209},"Radioaktivnost beta ukupna"]
["Radioaktivnost gama ukupna",696,"RAD0003-0001","mBq/l",{"$f":"IF(ISERROR(VLOOKUP(A211,'Obrazac B2'!$C$55:'Obrazac B2'!$C$58,1,FALSE)),A211,\"\")","v":"Radioaktivnost gama ukupna"},1,{"$f":"IF(F211=0,\"\",COUNTIF($F$2:F211,\">0\"))","v":210},"Radioaktivnost gama ukupna"]
["Klor ukupni",702,"ION0016-0003","mg/l",{"$f":"IF(ISERROR(VLOOKUP(A212,'Obrazac B2'!$C$55:'Obrazac B2'!$C$58,1,FALSE)),A212,\"\")","v":"Klor ukupni"},1,{"$f":"IF(F212=0,\"\",COUNTIF($F$2:F212,\">0\"))","v":211},"Klor ukupni"]
["Selen otopljeni",707,"MET0020-0002","mg/l",{"$f":"IF(ISERROR(VLOOKUP(A213,'Obrazac B2'!$C$55:'Obrazac B2'!$C$58,1,FALSE)),A213,\"\")","v":"Selen otopljeni"},1,{"$f":"IF(F213=0,\"\",COUNTIF($F$2:F213,\">0\"))","v":212},"Selen otopljeni"]
["Selen ukupni",709,"MET0020-0004","mg/l",{"$f":"IF(ISERROR(VLOOKUP(A214,'Obrazac B2'!$C$55:'Obrazac B2'!$C$58,1,FALSE)),A214,\"\")","v":"Selen ukupni"},1,{"$f":"IF(F214=0,\"\",COUNTIF($F$2:F214,\">0\"))","v":213},"Selen ukupni"]
["Simazin",713,"ORG0242-0002","mg/l",{"$f":"IF(ISERROR(VLOOKUP(A215,'Obrazac B2'!$C$55:'Obrazac B2'!$C$58,1,FALSE)),A215,\"\")","v":"Simazin"},1,{"$f":"IF(F215=0,\"\",COUNTIF($F$2:F215,\">0\"))","v":214},"Simazin"]
["Srebro otopljeno",718,"MET0021-0002","mg/l",{"$f":"IF(ISERROR(VLOOKUP(A216,'Obrazac B2'!$C$55:'Obrazac B2'!$C$58,1,FALSE)),A216,\"\")","v":"Srebro otopljeno"},1,{"$f":"IF(F216=0,\"\",COUNTIF($F$2:F216,\">0\"))","v":215},"Srebro otopljeno"]
["Srebro ukupno",720,"MET0021-0004","mg/l",{"$f":"IF(ISERROR(VLOOKUP(A217,'Obrazac B2'!$C$55:'Obrazac B2'!$C$58,1,FALSE)),A217,\"\")","v":"Srebro ukupno"},1,{"$f":"IF(F217=0,\"\",COUNTIF($F$2:F217,\">0\"))","v":216},"Srebro ukupno"]
["Stiren",723,"ORG0244-0002","mg/l",{"$f":"IF(ISERROR(VLOOKUP(A218,'Obrazac B2'!$C$55:'Obrazac B2'!$C$58,1,FALSE)),A218,\"\")","v":"Stiren"},1,{"$f":"IF(F218=0,\"\",COUNTIF($F$2:F218,\">0\"))","v":217},"Stiren"]
["Stroncij otopljeni",725,"MET0022-0002","mg/l",{"$f":"IF(ISERROR(VLOOKUP(A219,'Obrazac B2'!$C$55:'Obrazac B2'!$C$58,1,FALSE)),A219,\"\")","v":"Stroncij otopljeni"},1,{"$f":"IF(F219=0,\"\",COUNTIF($F$2:F219,\">0\"))","v":218},"Stroncij otopljeni"]
["Stroncij ukupni",726,"MET0022-0003","mg/l",{"$f":"IF(ISERROR(VLOOKUP(A220,'Obrazac B2'!$C$55:'Obrazac B2'!$C$58,1,FALSE)),A220,\"\")","v":"Stroncij ukupni"},1,{"$f":"IF(F220=0,\"\",COUNTIF($F$2:F220,\">0\"))","v":219},"Stroncij ukupni"]
["Suhi ostatak žareni 600°C",732,"FKP0019-0002","mg/l",{"$f":"IF(ISERROR(VLOOKUP(A221,'Obrazac B2'!$C$55:'Obrazac B2'!$C$58,1,FALSE)),A221,\"\")","v":"Suhi ostatak žareni 600°C"},1,{"$f":"IF(F221=0,\"\",COUNTIF($F$2:F221,\">0\"))","v":220},"Suhi ostatak žareni 600°C"]
["Sulfametoksazol",742,"ORG0253-0001","µg/l",{"$f":"IF(ISERROR(VLOOKUP(A222,'Obrazac B2'!$C$55:'Obrazac B2'!$C$58,1,FALSE)),A222,\"\")","v":"Sulfametoksazol"},{"$f":"IFERROR(SEARCH(INDIRECT(CELL(\"address\")),E222),0)","v":1},{"$f":"IF(F222=0,\"\",COUNTIF($F$2:F222,\">0\"))","v":221},"Sulfametoksazol"]
["Sulfati",747,"ION0018-0001","mg/l",{"$f":"IF(ISERROR(VLOOKUP(A223,'Obrazac B2'!$C$55:'Obrazac B2'!$C$58,1,FALSE)),A223,\"\")","v":"Sulfati"},1,{"$f":"IF(F223=0,\"\",COUNTIF($F$2:F223,\">0\"))","v":222},"Sulfati"]
["Sulfidi",749,"ION0019-0001","mg/l",{"$f":"IF(ISERROR(VLOOKUP(A224,'Obrazac B2'!$C$55:'Obrazac B2'!$C$58,1,FALSE)),A224,\"\")","v":"Sulfidi"},1,{"$f":"IF(F224=0,\"\",COUNTIF($F$2:F224,\">0\"))","v":223},"Sulfidi"]
["Sulfiti",751,"ION0020-0001","mg/l",{"$f":"IF(ISERROR(VLOOKUP(A225,'Obrazac B2'!$C$55:'Obrazac B2'!$C$58,1,FALSE)),A225,\"\")","v":"Sulfiti"},1,{"$f":"IF(F225=0,\"\",COUNTIF($F$2:F225,\">0\"))","v":224},"Sulfiti"]
["Suspendirane tvari žarene",757,"FKP0021-0001","mg/l",{"$f":"IF(ISERROR(VLOOKUP(A226,'Obrazac B2'!$C$55:'Obrazac B2'!$C$58,1,FALSE)),A226,\"\")","v":"Suspendirane tvari žarene"},1,{"$f":"IF(F226=0,\"\",COUNTIF($F$2:F226,\">0\"))","v":225},"Suspendirane tvari žarene"]
["Talij otopljeni",759,"MET0023-0002","mg/l",{"$f":"IF(ISERROR(VLOOKUP(A227,'Obrazac B2'!$C$55:'Obrazac B2'!$C$58,1,FALSE)),A227,\"\")","v":"Talij otopljeni"},1,{"$f":"IF(F227=0,\"\",COUNTIF($F$2:F227,\">0\"))","v":226},"Talij otopljeni"]
["Talij ukupni",760,"MET0023-0003","mg/l",{"$f":"IF(ISERROR(VLOOKUP(A228,'Obrazac B2'!$C$55:'Obrazac B2'!$C$58,1,FALSE)),A228,\"\")","v":"Talij ukupni"},1,{"$f":"IF(F228=0,\"\",COUNTIF($F$2:F228,\">0\"))","v":227},"Talij ukupni"]
["Telur otopljeni",764,"MET0024-0002","mg/l",{"$f":"IF(ISERROR(VLOOKUP(A229,'Obrazac B2'!$C$55:'Obrazac B2'!$C$58,1,FALSE)),A229,\"\")","v":"Telur otopljeni"},1,{"$f":"IF(F229=0,\"\",COUNTIF($F$2:F229,\">0\"))","v":228},"Telur otopljeni"]
["Telur ukupni",765,"MET0024-0003","mg/l",{"$f":"IF(ISERROR(VLOOKUP(A230,'Obrazac B2'!$C$55:'Obrazac B2'!$C$58,1,FALSE)),A230,\"\")","v":"Telur ukupni"},1,{"$f":"IF(F230=0,\"\",COUNTIF($F$2:F230,\">0\"))","v":229},"Telur ukupni"]
["Temperatura vode - bioreaktor",1114,"FKP0023-0002","°C",{"$f":"IF(ISERROR(VLOOKUP(A231,'Obrazac B2'!$C$55:'Obrazac B2'!$C$58,1,FALSE)),A231,\"\")","v":"Temperatura vode - bioreaktor"},{"$f":"IFERROR(SEARCH(INDIRECT(CELL(\"address\")),E231),0)","v":1},{"$f":"IF(F231=0,\"\",COUNTIF($F$2:F231,\">0\"))","v":230},"Temperatura vode - bioreaktor"]
["Terbutrin",770,"ORG0264-0002","mg/l",{"$f":"IF(ISERROR(VLOOKUP(A232,'Obrazac B2'!$C$55:'Obrazac B2'!$C$58,1,FALSE)),A232,\"\")","v":"Terbutrin"},1,{"$f":"IF(F232=0,\"\",COUNTIF($F$2:F232,\">0\"))","v":231},"Terbutrin"]
["Teškohlapljive lipofilne tvari",772,"ORG0291-0001","mg/l",{"$f":"IF(ISERROR(VLOOKUP(A233,'Obrazac B2'!$C$55:'Obrazac B2'!$C$58,1,FALSE)),A233,\"\")","v":"Teškohlapljive lipofilne tvari"},1,{"$f":"IF(F233=0,\"\",COUNTIF($F$2:F233,\">0\"))","v":232},"Teškohlapljive lipofilne tvari"]
["Tetrakloretilen",777,"ORG0266-0003","mg/l",{"$f":"IF(ISERROR(VLOOKUP(A234,'Obrazac B2'!$C$55:'Obrazac B2'!$C$58,1,FALSE)),A234,\"\")","v":"Tetrakloretilen"},1,{"$f":"IF(F234=0,\"\",COUNTIF($F$2:F234,\">0\"))","v":233},"Tetrakloretilen"]
["Tetraklormetan (tetraklorugljik)",780,"ORG0267-0002","mg/l",{"$f":"IF(ISERROR(VLOOKUP(A235,'Obrazac B2'!$C$55:'Obrazac B2'!$C$58,1,FALSE)),A235,\"\")","v":"Tetraklormetan (tetraklorugljik)"},1,{"$f":"IF(F235=0,\"\",COUNTIF($F$2:F235,\">0\"))","v":234},"Tetraklormetan (tetraklorugljik)"]
["Titanij otopljeni",788,"MET0025-0001","mg/l",{"$f":"IF(ISERROR(VLOOKUP(A236,'Obrazac B2'!$C$55:'Obrazac B2'!$C$58,1,FALSE)),A236,\"\")","v":"Titanij otopljeni"},1,{"$f":"IF(F236=0,\"\",COUNTIF($F$2:F236,\">0\"))","v":235},"Titanij otopljeni"]
["Titanij ukupni",789,"MET0025-0002","mg/l",{"$f":"IF(ISERROR(VLOOKUP(A237,'Obrazac B2'!$C$55:'Obrazac B2'!$C$58,1,FALSE)),A237,\"\")","v":"Titanij ukupni"},1,{"$f":"IF(F237=0,\"\",COUNTIF($F$2:F237,\">0\"))","v":236},"Titanij ukupni"]
["Torasemid",795,"ORG0277-0001","µg/l",{"$f":"IF(ISERROR(VLOOKUP(A238,'Obrazac B2'!$C$55:'Obrazac B2'!$C$58,1,FALSE)),A238,\"\")","v":"Torasemid"},{"$f":"IFERROR(SEARCH(INDIRECT(CELL(\"address\")),E238),0)","v":1},{"$f":"IF(F238=0,\"\",COUNTIF($F$2:F238,\">0\"))","v":237},"Torasemid"]
["Toluen",793,"ORG0276-0002","mg/l",{"$f":"IF(ISERROR(VLOOKUP(A239,'Obrazac B2'!$C$55:'Obrazac B2'!$C$58,1,FALSE)),A239,\"\")","v":"Toluen"},1,{"$f":"IF(F239=0,\"\",COUNTIF($F$2:F239,\">0\"))","v":238},"Toluen"]
["Tributilkositrovi spojevi",801,"ORG0282-0002","mg/l",{"$f":"IF(ISERROR(VLOOKUP(A240,'Obrazac B2'!$C$55:'Obrazac B2'!$C$58,1,FALSE)),A240,\"\")","v":"Tributilkositrovi spojevi"},1,{"$f":"IF(F240=0,\"\",COUNTIF($F$2:F240,\">0\"))","v":239},"Tributilkositrovi spojevi"]
["Trifenilkositrovi spojevi",804,"ORG0283-0001","mg/l",{"$f":"IF(ISERROR(VLOOKUP(A241,'Obrazac B2'!$C$55:'Obrazac B2'!$C$58,1,FALSE)),A241,\"\")","v":"Trifenilkositrovi spojevi"},1,{"$f":"IF(F241=0,\"\",COUNTIF($F$2:F241,\">0\"))","v":240},"Trifenilkositrovi spojevi"]
["Trifluralin",806,"ORG0284-0002","mg/l",{"$f":"IF(ISERROR(VLOOKUP(A242,'Obrazac B2'!$C$55:'Obrazac B2'!$C$58,1,FALSE)),A242,\"\")","v":"Trifluralin"},1,{"$f":"IF(F242=0,\"\",COUNTIF($F$2:F242,\">0\"))","v":241},"Trifluralin"]
["Triklorbenzen (svi izomeri)",810,"ORG0286-0002","mg/l",{"$f":"IF(ISERROR(VLOOKUP(A243,'Obrazac B2'!$C$55:'Obrazac B2'!$C$58,1,FALSE)),A243,\"\")","v":"Triklorbenzen (svi izomeri)"},1,{"$f":"IF(F243=0,\"\",COUNTIF($F$2:F243,\">0\"))","v":242},"Triklorbenzen (svi izomeri)"]
["Trikloretilen",814,"ORG0287-0003","mg/l",{"$f":"IF(ISERROR(VLOOKUP(A244,'Obrazac B2'!$C$55:'Obrazac B2'!$C$58,1,FALSE)),A244,\"\")","v":"Trikloretilen"},1,{"$f":"IF(F244=0,\"\",COUNTIF($F$2:F244,\">0\"))","v":243},"Trikloretilen"]
["Triklormetan (kloroform)",818,"ORG0289-0002","mg/l",{"$f":"IF(ISERROR(VLOOKUP(A245,'Obrazac B2'!$C$55:'Obrazac B2'!$C$58,1,FALSE)),A245,\"\")","v":"Triklormetan (kloroform)"},{"$f":"IFERROR(SEARCH(INDIRECT(CELL(\"address\")),E245),0)","v":1},{"$f":"IF(F245=0,\"\",COUNTIF($F$2:F245,\">0\"))","v":244},"Triklormetan (kloroform)"]
["Trimetoprim",1184,"ORG0336-0001","µg/l",{"$f":"IF(ISERROR(VLOOKUP(A246,'Obrazac B2'!$C$55:'Obrazac B2'!$C$58,1,FALSE)),A246,\"\")","v":"Trimetoprim"},1,{"$f":"IF(F246=0,\"\",COUNTIF($F$2:F246,\">0\"))","v":245},"Trimetoprim"]
["uk.susp.tvar teret",828,"TER0001-0003","kg/t proizv/sirovine",{"$f":"IF(ISERROR(VLOOKUP(A247,'Obrazac B2'!$C$55:'Obrazac B2'!$C$58,1,FALSE)),A247,\"\")","v":"uk.susp.tvar teret"},1,{"$f":"IF(F247=0,\"\",COUNTIF($F$2:F247,\">0\"))","v":246},"uk.susp.tvar teret"]
["Ukupne površinski aktivne tvari",834,"ORG0292-0001","mg/l",{"$f":"IF(ISERROR(VLOOKUP(A248,'Obrazac B2'!$C$55:'Obrazac B2'!$C$58,1,FALSE)),A248,\"\")","v":"Ukupne površinski aktivne tvari"},1,{"$f":"IF(F248=0,\"\",COUNTIF($F$2:F248,\">0\"))","v":247},"Ukupne površinski aktivne tvari"]
["Ukupni aromatski ugljikovodici ",836,"ORG0293-0001","mg/l",{"$f":"IF(ISERROR(VLOOKUP(A249,'Obrazac B2'!$C$55:'Obrazac B2'!$C$58,1,FALSE)),A249,\"\")","v":"Ukupni aromatski ugljikovodici "},1,{"$f":"IF(F249=0,\"\",COUNTIF($F$2:F249,\">0\"))","v":248},"Ukupni aromatski ugljikovodici "]
["Ukupni broj koliformnih bakterija",837,"MBP0016-0001","broj/100 ml",{"$f":"IF(ISERROR(VLOOKUP(A250,'Obrazac B2'!$C$55:'Obrazac B2'!$C$58,1,FALSE)),A250,\"\")","v":"Ukupni broj koliformnih bakterija"},1,{"$f":"IF(F250=0,\"\",COUNTIF($F$2:F250,\">0\"))","v":249},"Ukupni broj koliformnih bakterija"]
["Ukupni dušik",840,"HRT0010-0002","mgN/l",{"$f":"IF(ISERROR(VLOOKUP(A251,'Obrazac B2'!$C$55:'Obrazac B2'!$C$58,1,FALSE)),A251,\"\")","v":"Ukupni dušik"},1,{"$f":"IF(F251=0,\"\",COUNTIF($F$2:F251,\">0\"))","v":250},"Ukupni dušik"]
["Ukupni fosfor",841,"HRT0011-0001","mgP/l",{"$f":"IF(ISERROR(VLOOKUP(A252,'Obrazac B2'!$C$55:'Obrazac B2'!$C$58,1,FALSE)),A252,\"\")","v":"Ukupni fosfor"},1,{"$f":"IF(F252=0,\"\",COUNTIF($F$2:F252,\">0\"))","v":251},"Ukupni fosfor"]
["Lakohlapljivi klorirani ugljikovodici (LHKU)",845,"ORG0294-0002","mg/l",{"$f":"IF(ISERROR(VLOOKUP(A253,'Obrazac B2'!$C$55:'Obrazac B2'!$C$58,1,FALSE)),A253,\"\")","v":"Lakohlapljivi klorirani ugljikovodici (LHKU)"},1,{"$f":"IF(F253=0,\"\",COUNTIF($F$2:F253,\">0\"))","v":252},"Lakohlapljivi klorirani ugljikovodici (LHKU)"]
["Ukupni nitrirani ugljikovodici ",848,"ORG0295-0001","mg/l",{"$f":"IF(ISERROR(VLOOKUP(A254,'Obrazac B2'!$C$55:'Obrazac B2'!$C$58,1,FALSE)),A254,\"\")","v":"Ukupni nitrirani ugljikovodici "},1,{"$f":"IF(F254=0,\"\",COUNTIF($F$2:F254,\">0\"))","v":253},"Ukupni nitrirani ugljikovodici "]
["Ukupni organski ugljik (TOC)",849,"HRT0012-0001","mgC/l",{"$f":"IF(ISERROR(VLOOKUP(A255,'Obrazac B2'!$C$55:'Obrazac B2'!$C$58,1,FALSE)),A255,\"\")","v":"Ukupni organski ugljik (TOC)"},1,{"$f":"IF(F255=0,\"\",COUNTIF($F$2:F255,\">0\"))","v":254},"Ukupni organski ugljik (TOC)"]
["Ukupni ugljikovodici C10-C40",853,"ORG0177-0003","mg/l",{"$f":"IF(ISERROR(VLOOKUP(A256,'Obrazac B2'!$C$55:'Obrazac B2'!$C$58,1,FALSE)),A256,\"\")","v":"Ukupni ugljikovodici C10-C40"},1,{"$f":"IF(F256=0,\"\",COUNTIF($F$2:F256,\">0\"))","v":255},"Ukupni ugljikovodici C10-C40"]
["Uranij otopljeni",854,"MET0026-0001","mg/l",{"$f":"IF(ISERROR(VLOOKUP(A257,'Obrazac B2'!$C$55:'Obrazac B2'!$C$58,1,FALSE)),A257,\"\")","v":"Uranij otopljeni"},1,{"$f":"IF(F257=0,\"\",COUNTIF($F$2:F257,\">0\"))","v":256},"Uranij otopljeni"]
["Uranij ukupni",855,"MET0026-0002","mg/l",{"$f":"IF(ISERROR(VLOOKUP(A258,'Obrazac B2'!$C$55:'Obrazac B2'!$C$58,1,FALSE)),A258,\"\")","v":"Uranij ukupni"},1,{"$f":"IF(F258=0,\"\",COUNTIF($F$2:F258,\">0\"))","v":257},{"$f":"IFERROR(INDEX(E:E,MATCH(ROW(F257),G:G,0)),\"\")","v":"Uranij ukupni"}]
["Vanadij otopljeni",867,"MET0027-0002","mg/l",{"$f":"IF(ISERROR(VLOOKUP(A259,'Obrazac B2'!$C$55:'Obrazac B2'!$C$58,1,FALSE)),A259,\"\")","v":"Vanadij otopljeni"},1,{"$f":"IF(F259=0,\"\",COUNTIF($F$2:F259,\">0\"))","v":258},"Vanadij otopljeni"]
["Vanadij ukupni",869,"MET0027-0004","mg/l",{"$f":"IF(ISERROR(VLOOKUP(A260,'Obrazac B2'!$C$55:'Obrazac B2'!$C$58,1,FALSE)),A260,\"\")","v":"Vanadij ukupni"},1,{"$f":"IF(F260=0,\"\",COUNTIF($F$2:F260,\">0\"))","v":259},"Vanadij ukupni"]
["Varfarin",923,"ORG0315-0001","µg/l",{"$f":"IF(ISERROR(VLOOKUP(A261,'Obrazac B2'!$C$55:'Obrazac B2'!$C$58,1,FALSE)),A261,\"\")","v":"Varfarin"},{"$f":"IFERROR(SEARCH(INDIRECT(CELL(\"address\")),E261),0)","v":1},{"$f":"IF(F261=0,\"\",COUNTIF($F$2:F261,\">0\"))","v":260},"Varfarin"]
["Vinil klorid",871,"ORG0296-0002","mg/l",{"$f":"IF(ISERROR(VLOOKUP(A262,'Obrazac B2'!$C$55:'Obrazac B2'!$C$58,1,FALSE)),A262,\"\")","v":"Vinil klorid"},1,{"$f":"IF(F262=0,\"\",COUNTIF($F$2:F262,\">0\"))","v":261},"Vinil klorid"]
["Željezo otopljeno",879,"MET0028-0002","mg/l",{"$f":"IF(ISERROR(VLOOKUP(A263,'Obrazac B2'!$C$55:'Obrazac B2'!$C$58,1,FALSE)),A263,\"\")","v":"Željezo otopljeno"},1,{"$f":"IF(F263=0,\"\",COUNTIF($F$2:F263,\">0\"))","v":262},"Željezo otopljeno"]
["Željezo ukupno",881,"MET0028-0004","mg/l",{"$f":"IF(ISERROR(VLOOKUP(A264,'Obrazac B2'!$C$55:'Obrazac B2'!$C$58,1,FALSE)),A264,\"\")","v":"Željezo ukupno"},1,{"$f":"IF(F264=0,\"\",COUNTIF($F$2:F264,\">0\"))","v":263},"Željezo ukupno"]
["Živa otopljena",884,"MET0030-0002","mg/l",{"$f":"IF(ISERROR(VLOOKUP(A265,'Obrazac B2'!$C$55:'Obrazac B2'!$C$58,1,FALSE)),A265,\"\")","v":"Živa otopljena"},1,{"$f":"IF(F265=0,\"\",COUNTIF($F$2:F265,\">0\"))","v":264},"Živa otopljena"]
["Živa ukupna",886,"MET0030-0004","mg/l",{"$f":"IF(ISERROR(VLOOKUP(A266,'Obrazac B2'!$C$55:'Obrazac B2'!$C$58,1,FALSE)),A266,\"\")","v":"Živa ukupna"},1,{"$f":"IF(F266=0,\"\",COUNTIF($F$2:F266,\">0\"))","v":265},"Živa ukupna"]
["α-endosulfan",889,"ORG0299-0002","mg/l",{"$f":"IF(ISERROR(VLOOKUP(A267,'Obrazac B2'!$C$55:'Obrazac B2'!$C$58,1,FALSE)),A267,\"\")","v":"α-endosulfan"},{"$f":"IFERROR(SEARCH(INDIRECT(CELL(\"address\")),E267),0)","v":1},{"$f":"IF(F267=0,\"\",COUNTIF($F$2:F267,\">0\"))","v":266},"α-endosulfan"]
["α-heksabromociklododekan",892,"ORG0300-0002","mg/l",{"$f":"IF(ISERROR(VLOOKUP(A268,'Obrazac B2'!$C$55:'Obrazac B2'!$C$58,1,FALSE)),A268,\"\")","v":"α-heksabromociklododekan"},1,{"$f":"IF(F268=0,\"\",COUNTIF($F$2:F268,\">0\"))","v":267},"α-heksabromociklododekan"]
["α-heksaklorcikloheksan (HCH)",895,"ORG0301-0002","mg/l",{"$f":"IF(ISERROR(VLOOKUP(A269,'Obrazac B2'!$C$55:'Obrazac B2'!$C$58,1,FALSE)),A269,\"\")","v":"α-heksaklorcikloheksan (HCH)"},1,{"$f":"IF(F269=0,\"\",COUNTIF($F$2:F269,\">0\"))","v":268},"α-heksaklorcikloheksan (HCH)"]
["β-heksabromociklododekan ",900,"ORG0303-0002","mg/l",{"$f":"IF(ISERROR(VLOOKUP(A270,'Obrazac B2'!$C$55:'Obrazac B2'!$C$58,1,FALSE)),A270,\"\")","v":"β-heksabromociklododekan "},1,{"$f":"IF(F270=0,\"\",COUNTIF($F$2:F270,\">0\"))","v":269},"β-heksabromociklododekan "]
["β-Heksaklorcikloheksan (HCH)",903,"ORG0304-0002","mg/l",{"$f":"IF(ISERROR(VLOOKUP(A271,'Obrazac B2'!$C$55:'Obrazac B2'!$C$58,1,FALSE)),A271,\"\")","v":"β-Heksaklorcikloheksan (HCH)"},1,{"$f":"IF(F271=0,\"\",COUNTIF($F$2:F271,\">0\"))","v":270},"β-Heksaklorcikloheksan (HCH)"]
["γ-heksabromociklododekan",905,"ORG0305-0001","mg/l",{"$f":"IF(ISERROR(VLOOKUP(A272,'Obrazac B2'!$C$55:'Obrazac B2'!$C$58,1,FALSE)),A272,\"\")","v":"γ-heksabromociklododekan"},1,{"$f":"IF(F272=0,\"\",COUNTIF($F$2:F272,\">0\"))","v":271},"γ-heksabromociklododekan"]
["γ-Heksaklorcikloheksan (HCH) - Lindan",909,"ORG0307-0002","mg/l",{"$f":"IF(ISERROR(VLOOKUP(A273,'Obrazac B2'!$C$55:'Obrazac B2'!$C$58,1,FALSE)),A273,\"\")","v":"γ-Heksaklorcikloheksan (HCH) - Lindan"},1,{"$f":"IF(F273=0,\"\",COUNTIF($F$2:F273,\">0\"))","v":272},"γ-Heksaklorcikloheksan (HCH) - Lindan"]
["Δ TP",911,"FKP0036-0001","°C",{"$f":"IF(ISERROR(VLOOKUP(A274,'Obrazac B2'!$C$55:'Obrazac B2'!$C$58,1,FALSE)),A274,\"\")","v":"Δ TP"},1,{"$f":"IF(F274=0,\"\",COUNTIF($F$2:F274,\">0\"))","v":273},"Δ TP"]
["Δ TR",912,"FKP0036-0002","°C",{"$f":"IF(ISERROR(VLOOKUP(A275,'Obrazac B2'!$C$55:'Obrazac B2'!$C$58,1,FALSE)),A275,\"\")","v":"Δ TR"},1,{"$f":"IF(F275=0,\"\",COUNTIF($F$2:F275,\">0\"))","v":274},"Δ TR"]
["δ-Heksaklorcikloheksan (HCH)",914,"ORG0308-0002","mg/l",{"$f":"IF(ISERROR(VLOOKUP(A276,'Obrazac B2'!$C$55:'Obrazac B2'!$C$58,1,FALSE)),A276,\"\")","v":"δ-Heksaklorcikloheksan (HCH)"},1,{"$f":"IF(F276=0,\"\",COUNTIF($F$2:F276,\">0\"))","v":275},"δ-Heksaklorcikloheksan (HCH)"]
["Ukupni halogenirani ugljikovodici ",917,"ORG0309-0001","mg/l",{"$f":"IF(ISERROR(VLOOKUP(A277,'Obrazac B2'!$C$55:'Obrazac B2'!$C$58,1,FALSE)),A277,\"\")","v":"Ukupni halogenirani ugljikovodici "},1,{"$f":"IF(F277=0,\"\",COUNTIF($F$2:F277,\">0\"))","v":276},"Ukupni halogenirani ugljikovodici "]
["Klor slobodni",1091,"ION0015-0003","mg/l",{"$f":"IF(ISERROR(VLOOKUP(A278,'Obrazac B2'!$C$55:'Obrazac B2'!$C$58,1,FALSE)),A278,\"\")","v":"Klor slobodni"},1,{"$f":"IF(F278=0,\"\",COUNTIF($F$2:F278,\">0\"))","v":277},"Klor slobodni"]
["Amoksicilin",919,"ORG0310-0001","µg/l",{"$f":"IF(ISERROR(VLOOKUP(A279,'Obrazac B2'!$C$55:'Obrazac B2'!$C$58,1,FALSE)),A279,\"\")","v":"Amoksicilin"},1,{"$f":"IF(F279=0,\"\",COUNTIF($F$2:F279,\">0\"))","v":278},"Amoksicilin"]
["Azitromicin",146,"ORG0052-0002","mg/l",{"$f":"IF(ISERROR(VLOOKUP(A280,'Obrazac B2'!$C$55:'Obrazac B2'!$C$58,1,FALSE)),A280,\"\")","v":"Azitromicin"},1,{"$f":"IF(F280=0,\"\",COUNTIF($F$2:F280,\">0\"))","v":279},"Azitromicin"]
["Azitromicin-N-dezmetilazitromicin",921,"ORG0311-0001","µg/l",{"$f":"IF(ISERROR(VLOOKUP(A281,'Obrazac B2'!$C$55:'Obrazac B2'!$C$58,1,FALSE)),A281,\"\")","v":"Azitromicin-N-dezmetilazitromicin"},1,{"$f":"IF(F281=0,\"\",COUNTIF($F$2:F281,\">0\"))","v":280},"Azitromicin-N-dezmetilazitromicin"]
["Ciprofloksacin",920,"ORG0312-0001","µg/l",{"$f":"IF(ISERROR(VLOOKUP(A282,'Obrazac B2'!$C$55:'Obrazac B2'!$C$58,1,FALSE)),A282,\"\")","v":"Ciprofloksacin"},1,{"$f":"IF(F282=0,\"\",COUNTIF($F$2:F282,\">0\"))","v":281},"Ciprofloksacin"]
["Eritromicin",303,"ORG0105-0002","mg/l",{"$f":"IF(ISERROR(VLOOKUP(A283,'Obrazac B2'!$C$55:'Obrazac B2'!$C$58,1,FALSE)),A283,\"\")","v":"Eritromicin"},1,{"$f":"IF(F283=0,\"\",COUNTIF($F$2:F283,\">0\"))","v":282},"Eritromicin"]
["Klaritromicin",384,"ORG0147-0001","µg/l",{"$f":"IF(ISERROR(VLOOKUP(A284,'Obrazac B2'!$C$55:'Obrazac B2'!$C$58,1,FALSE)),A284,\"\")","v":"Klaritromicin"},1,{"$f":"IF(F284=0,\"\",COUNTIF($F$2:F284,\">0\"))","v":283},"Klaritromicin"]
["Levotiroksin natrij hidrat",1195,"ORG0347-0001","µg/l",{"$f":"IF(ISERROR(VLOOKUP(A285,'Obrazac B2'!$C$55:'Obrazac B2'!$C$58,1,FALSE)),A285,\"\")","v":"Levotiroksin natrij hidrat"},1,{"$f":"IF(F285=0,\"\",COUNTIF($F$2:F285,\">0\"))","v":284},"Levotiroksin natrij hidrat"]
["Memantin",922,"ORG0313-0001","µg/l",{"$f":"IF(ISERROR(VLOOKUP(A286,'Obrazac B2'!$C$55:'Obrazac B2'!$C$58,1,FALSE)),A286,\"\")","v":"Memantin"},1,{"$f":"IF(F286=0,\"\",COUNTIF($F$2:F286,\">0\"))","v":285},"Memantin"]
["Metionin, DL-",1194,"ORG0346-0001","µg/l",{"$f":"IF(ISERROR(VLOOKUP(A287,'Obrazac B2'!$C$55:'Obrazac B2'!$C$58,1,FALSE)),A287,\"\")","v":"Metionin, DL-"},1,{"$f":"IF(F287=0,\"\",COUNTIF($F$2:F287,\">0\"))","v":286},"Metionin, DL-"]
["Oksitetraciklin hidroklorid",546,"ORG0188-0001","mg/l",{"$f":"IF(ISERROR(VLOOKUP(A288,'Obrazac B2'!$C$55:'Obrazac B2'!$C$58,1,FALSE)),A288,\"\")","v":"Oksitetraciklin hidroklorid"},1,{"$f":"IF(F288=0,\"\",COUNTIF($F$2:F288,\">0\"))","v":287},"Oksitetraciklin hidroklorid"]
["Pimobendan",1196,"ORG0348-0001","µg/l",{"$f":"IF(ISERROR(VLOOKUP(A289,'Obrazac B2'!$C$55:'Obrazac B2'!$C$58,1,FALSE)),A289,\"\")","v":"Pimobendan"},1,{"$f":"IF(F289=0,\"\",COUNTIF($F$2:F289,\">0\"))","v":288},"Pimobendan"]
["Sulfametoksazol",742,"ORG0253-0001","µg/l",{"$f":"IF(ISERROR(VLOOKUP(A290,'Obrazac B2'!$C$55:'Obrazac B2'!$C$58,1,FALSE)),A290,\"\")","v":"Sulfametoksazol"},1,{"$f":"IF(F290=0,\"\",COUNTIF($F$2:F290,\">0\"))","v":289},"Sulfametoksazol"]
["Torasemid",795,"ORG0277-0001","µg/l",{"$f":"IF(ISERROR(VLOOKUP(A291,'Obrazac B2'!$C$55:'Obrazac B2'!$C$58,1,FALSE)),A291,\"\")","v":"Torasemid"},1,{"$f":"IF(F291=0,\"\",COUNTIF($F$2:F291,\">0\"))","v":290},"Torasemid"]
["Trimetoprim",1184,"ORG0336-0001","µg/l",{"$f":"IF(ISERROR(VLOOKUP(A292,'Obrazac B2'!$C$55:'Obrazac B2'!$C$58,1,FALSE)),A292,\"\")","v":"Trimetoprim"},1,{"$f":"IF(F292=0,\"\",COUNTIF($F$2:F292,\">0\"))","v":291},"Trimetoprim"]
["Varfarin",923,"ORG0315-0001","µg/l",{"$f":"IF(ISERROR(VLOOKUP(A293,'Obrazac B2'!$C$55:'Obrazac B2'!$C$58,1,FALSE)),A293,\"\")","v":"Varfarin"},1,{"$f":"IF(F293=0,\"\",COUNTIF($F$2:F293,\">0\"))","v":292},"Varfarin"]
["Ukupne otopljene tvari",833,"FKP0030-0001","mg/l",{"$f":"IF(ISERROR(VLOOKUP(A294,'Obrazac B2'!$C$55:'Obrazac B2'!$C$58,1,FALSE)),A294,\"\")","v":"Ukupne otopljene tvari"},{"$f":"IFERROR(SEARCH(INDIRECT(CELL(\"address\")),E294),0)","v":1},{"$f":"IF(F294=0,\"\",COUNTIF($F$2:F294,\">0\"))","v":293},"Ukupne otopljene tvari"]
["4-nonilfenol",1420,"ORG0035-0003","mg/l",{"$f":"IF(ISERROR(VLOOKUP(A295,'Obrazac B2'!$C$55:'Obrazac B2'!$C$58,1,FALSE)),A295,\"\")","v":"4-nonilfenol"},{"$f":"IFERROR(SEARCH(INDIRECT(CELL(\"address\")),E295),0)","v":1},{"$f":"IF(F295=0,\"\",COUNTIF($F$2:F295,\">0\"))","v":294},"4-nonilfenol"]
["4-tert-oktilfenol",1422,"ORG0031-0003","mg/l",{"$f":"IF(ISERROR(VLOOKUP(A296,'Obrazac B2'!$C$55:'Obrazac B2'!$C$58,1,FALSE)),A296,\"\")","v":"4-tert-oktilfenol"},1,{"$f":"IF(F296=0,\"\",COUNTIF($F$2:F296,\">0\"))","v":295},"4-tert-oktilfenol"]
["4-nonilfenol dietoksilat",1421,"ORG0407-0001","mg/l",{"$f":"IF(ISERROR(VLOOKUP(A297,'Obrazac B2'!$C$55:'Obrazac B2'!$C$58,1,FALSE)),A297,\"\")","v":"4-nonilfenol dietoksilat"},1,{"$f":"IF(F297=0,\"\",COUNTIF($F$2:F297,\">0\"))","v":296},"4-nonilfenol dietoksilat"]
["4-tert-oktilfenol dietoksilat",1423,"ORG0408-0001","mg/l",{"$f":"IF(ISERROR(VLOOKUP(A298,'Obrazac B2'!$C$55:'Obrazac B2'!$C$58,1,FALSE)),A298,\"\")","v":"4-tert-oktilfenol dietoksilat"},1,{"$f":"IF(F298=0,\"\",COUNTIF($F$2:F298,\">0\"))","v":297},"4-tert-oktilfenol dietoksilat"]
["Acenaften",1424,"ORG0409-0001","mg/l",{"$f":"IF(ISERROR(VLOOKUP(A299,'Obrazac B2'!$C$55:'Obrazac B2'!$C$58,1,FALSE)),A299,\"\")","v":"Acenaften"},1,{"$f":"IF(F299=0,\"\",COUNTIF($F$2:F299,\">0\"))","v":298},"Acenaften"]
["Acenaftilen",1425,"ORG0410-0001","mg/l",{"$f":"IF(ISERROR(VLOOKUP(A300,'Obrazac B2'!$C$55:'Obrazac B2'!$C$58,1,FALSE)),A300,\"\")","v":"Acenaftilen"},1,{"$f":"IF(F300=0,\"\",COUNTIF($F$2:F300,\">0\"))","v":299},"Acenaftilen"]
["Benzo(a)antracen",1426,"ORG0411-0001","mg/l",{"$f":"IF(ISERROR(VLOOKUP(A301,'Obrazac B2'!$C$55:'Obrazac B2'!$C$58,1,FALSE)),A301,\"\")","v":"Benzo(a)antracen"},1,{"$f":"IF(F301=0,\"\",COUNTIF($F$2:F301,\">0\"))","v":300},"Benzo(a)antracen"]
["Dibenzo(a,h)antracen",1427,"ORG0412-0001","mg/l",{"$f":"IF(ISERROR(VLOOKUP(A302,'Obrazac B2'!$C$55:'Obrazac B2'!$C$58,1,FALSE)),A302,\"\")","v":"Dibenzo(a,h)antracen"},1,{"$f":"IF(F302=0,\"\",COUNTIF($F$2:F302,\">0\"))","v":301},"Dibenzo(a,h)antracen"]
["Fenantren",1428,"ORG0413-0001","mg/l",{"$f":"IF(ISERROR(VLOOKUP(A303,'Obrazac B2'!$C$55:'Obrazac B2'!$C$58,1,FALSE)),A303,\"\")","v":"Fenantren"},1,{"$f":"IF(F303=0,\"\",COUNTIF($F$2:F303,\">0\"))","v":302},"Fenantren"]
["Fluoren",1429,"ORG0414-0001","mg/l",{"$f":"IF(ISERROR(VLOOKUP(A304,'Obrazac B2'!$C$55:'Obrazac B2'!$C$58,1,FALSE)),A304,\"\")","v":"Fluoren"},1,{"$f":"IF(F304=0,\"\",COUNTIF($F$2:F304,\">0\"))","v":303},"Fluoren"]
["Krizen",1430,"ORG0415-0001","mg/l",{"$f":"IF(ISERROR(VLOOKUP(A305,'Obrazac B2'!$C$55:'Obrazac B2'!$C$58,1,FALSE)),A305,\"\")","v":"Krizen"},1,{"$f":"IF(F305=0,\"\",COUNTIF($F$2:F305,\">0\"))","v":304},"Krizen"]
["Piren",1431,"ORG0416-0001","mg/l",{"$f":"IF(ISERROR(VLOOKUP(A306,'Obrazac B2'!$C$55:'Obrazac B2'!$C$58,1,FALSE)),A306,\"\")","v":"Piren"},1,{"$f":"IF(F306=0,\"\",COUNTIF($F$2:F306,\">0\"))","v":305},"Piren"]
["2,4' DDD",1433,"ORG0417-0001","mg/l",{"$f":"IF(ISERROR(VLOOKUP(A307,'Obrazac B2'!$C$55:'Obrazac B2'!$C$58,1,FALSE)),A307,\"\")","v":"2,4' DDD"},1,{"$f":"IF(F307=0,\"\",COUNTIF($F$2:F307,\">0\"))","v":306},"2,4' DDD"]
["2,4' DDE",1434,"ORG0418-0001","mg/l",{"$f":"IF(ISERROR(VLOOKUP(A308,'Obrazac B2'!$C$55:'Obrazac B2'!$C$58,1,FALSE)),A308,\"\")","v":"2,4' DDE"},1,{"$f":"IF(F308=0,\"\",COUNTIF($F$2:F308,\">0\"))","v":307},"2,4' DDE"]
["β-endosulfan",1432,"ORG0302-0003","mg/l",{"$f":"IF(ISERROR(VLOOKUP(A309,'Obrazac B2'!$C$55:'Obrazac B2'!$C$58,1,FALSE)),A309,\"\")","v":"β-endosulfan"},1,{"$f":"IF(F309=0,\"\",COUNTIF($F$2:F309,\">0\"))","v":308},"β-endosulfan"]
["Perfluoroktansulfonska kiselina i derivati (PFOS)",664,"ORG0226-0001","µg/l",{"$f":"IF(ISERROR(VLOOKUP(A310,'Obrazac B2'!$C$55:'Obrazac B2'!$C$58,1,FALSE)),A310,\"\")","v":"Perfluoroktansulfonska kiselina i derivati (PFOS)"},1,{"$f":"IF(F310=0,\"\",COUNTIF($F$2:F310,\">0\"))","v":309},{"$f":"IFERROR(INDEX(E:E,MATCH(ROW(F309),G:G,0)),\"\")","v":"Perfluoroktansulfonska kiselina i derivati (PFOS)"}]
["Perfluorobutanska kiselina (PFBA)",1378,"ORG0371-0001","µg/l",{"$f":"IF(ISERROR(VLOOKUP(A311,'Obrazac B2'!$C$55:'Obrazac B2'!$C$58,1,FALSE)),A311,\"\")","v":"Perfluorobutanska kiselina (PFBA)"},1,{"$f":"IF(F311=0,\"\",COUNTIF($F$2:F311,\">0\"))","v":310},"Perfluorobutanska kiselina (PFBA)"]
["Perfluoropentanska kiselina (PFPeA)",1379,"ORG0372-0001","µg/l",{"$f":"IF(ISERROR(VLOOKUP(A312,'Obrazac B2'!$C$55:'Obrazac B2'!$C$58,1,FALSE)),A312,\"\")","v":"Perfluoropentanska kiselina (PFPeA)"},1,{"$f":"IF(F312=0,\"\",COUNTIF($F$2:F312,\">0\"))","v":311},"Perfluoropentanska kiselina (PFPeA)"]
["Perfluoroheksanska kiselina (PFHxA)",1380,"ORG0373-0001","µg/l",{"$f":"IF(ISERROR(VLOOKUP(A313,'Obrazac B2'!$C$55:'Obrazac B2'!$C$58,1,FALSE)),A313,\"\")","v":"Perfluoroheksanska kiselina (PFHxA)"},1,{"$f":"IF(F313=0,\"\",COUNTIF($F$2:F313,\">0\"))","v":312},"Perfluoroheksanska kiselina (PFHxA)"]
["Perfluoroheptanska kiselina (PFHpA)",1381,"ORG0374-0001","µg/l",{"$f":"IF(ISERROR(VLOOKUP(A314,'Obrazac B2'!$C$55:'Obrazac B2'!$C$58,1,FALSE)),A314,\"\")","v":"Perfluoroheptanska kiselina (PFHpA)"},1,{"$f":"IF(F314=0,\"\",COUNTIF($F$2:F314,\">0\"))","v":313},"Perfluoroheptanska kiselina (PFHpA)"]
["Perfluorooktanska kiselina (PFOA)",1382,"ORG0375-0001","µg/l",{"$f":"IF(ISERROR(VLOOKUP(A315,'Obrazac B2'!$C$55:'Obrazac B2'!$C$58,1,FALSE)),A315,\"\")","v":"Perfluorooktanska kiselina (PFOA)"},1,{"$f":"IF(F315=0,\"\",COUNTIF($F$2:F315,\">0\"))","v":314},"Perfluorooktanska kiselina (PFOA)"]
["Perfluorononanska kiselina (PFNA)",1383,"ORG0376-0001","µg/l",{"$f":"IF(ISERROR(VLOOKUP(A316,'Obrazac B2'!$C$55:'Obrazac B2'!$C$58,1,FALSE)),A316,\"\")","v":"Perfluorononanska kiselina (PFNA)"},1,{"$f":"IF(F316=0,\"\",COUNTIF($F$2:F316,\">0\"))","v":315},"Perfluorononanska kiselina (PFNA)"]
["Perfluorodekanska kiselina (PFDA)",1384,"ORG0377-0001","µg/l",{"$f":"IF(ISERROR(VLOOKUP(A317,'Obrazac B2'!$C$55:'Obrazac B2'!$C$58,1,FALSE)),A317,\"\")","v":"Perfluorodekanska kiselina (PFDA)"},1,{"$f":"IF(F317=0,\"\",COUNTIF($F$2:F317,\">0\"))","v":316},"Perfluorodekanska kiselina (PFDA)"]
["Perfluorobutan sulfonska kiselina (PFBS)",1388,"ORG0381-0001","µg/l",{"$f":"IF(ISERROR(VLOOKUP(A318,'Obrazac B2'!$C$55:'Obrazac B2'!$C$58,1,FALSE)),A318,\"\")","v":"Perfluorobutan sulfonska kiselina (PFBS)"},1,{"$f":"IF(F318=0,\"\",COUNTIF($F$2:F318,\">0\"))","v":317},"Perfluorobutan sulfonska kiselina (PFBS)"]
["Perfluoropentan sulfonska kiselina (PFPeS)",1389,"ORG0382-0001","µg/l",{"$f":"IF(ISERROR(VLOOKUP(A319,'Obrazac B2'!$C$55:'Obrazac B2'!$C$58,1,FALSE)),A319,\"\")","v":"Perfluoropentan sulfonska kiselina (PFPeS)"},1,{"$f":"IF(F319=0,\"\",COUNTIF($F$2:F319,\">0\"))","v":318},"Perfluoropentan sulfonska kiselina (PFPeS)"]
["Perfluoroheksan sulfonska kiselina (PFHxS)",1390,"ORG0383-0001","µg/l",{"$f":"IF(ISERROR(VLOOKUP(A320,'Obrazac B2'!$C$55:'Obrazac B2'!$C$58,1,FALSE)),A320,\"\")","v":"Perfluoroheksan sulfonska kiselina (PFHxS)"},1,{"$f":"IF(F320=0,\"\",COUNTIF($F$2:F320,\">0\"))","v":319},"Perfluoroheksan sulfonska kiselina (PFHxS)"]
["Perfluoroheptan sulfonska kiselina (PFHpS)",1391,"ORG0384-0001","µg/l",{"$f":"IF(ISERROR(VLOOKUP(A321,'Obrazac B2'!$C$55:'Obrazac B2'!$C$58,1,FALSE)),A321,\"\")","v":"Perfluoroheptan sulfonska kiselina (PFHpS)"},1,{"$f":"IF(F321=0,\"\",COUNTIF($F$2:F321,\">0\"))","v":320},"Perfluoroheptan sulfonska kiselina (PFHpS)"]
["Perfluorononan sulfonska kiselina (PFNS)",1392,"ORG0385-0001","µg/l",{"$f":"IF(ISERROR(VLOOKUP(A322,'Obrazac B2'!$C$55:'Obrazac B2'!$C$58,1,FALSE)),A322,\"\")","v":"Perfluorononan sulfonska kiselina (PFNS)"},1,{"$f":"IF(F322=0,\"\",COUNTIF($F$2:F322,\">0\"))","v":321},"Perfluorononan sulfonska kiselina (PFNS)"]
["4:2 Fluorotelomer sulfonska kiselina (4:2 FTS)",1436,"ORG0419-0001","µg/l",{"$f":"IF(ISERROR(VLOOKUP(A323,'Obrazac B2'!$C$55:'Obrazac B2'!$C$58,1,FALSE)),A323,\"\")","v":"4:2 Fluorotelomer sulfonska kiselina (4:2 FTS)"},1,{"$f":"IF(F323=0,\"\",COUNTIF($F$2:F323,\">0\"))","v":322},"4:2 Fluorotelomer sulfonska kiselina (4:2 FTS)"]
["6:2 Fluorotelomer sulfonska kiselina (6:2 FTS)",1437,"ORG0420-0001","µg/l",{"$f":"IF(ISERROR(VLOOKUP(A324,'Obrazac B2'!$C$55:'Obrazac B2'!$C$58,1,FALSE)),A324,\"\")","v":"6:2 Fluorotelomer sulfonska kiselina (6:2 FTS)"},1,{"$f":"IF(F324=0,\"\",COUNTIF($F$2:F324,\">0\"))","v":323},"6:2 Fluorotelomer sulfonska kiselina (6:2 FTS)"]
["8:2 Fluorotelomer sulfonska kiselina (8:2 FTS)",1438,"ORG0421-0001","µg/l",{"$f":"IF(ISERROR(VLOOKUP(A325,'Obrazac B2'!$C$55:'Obrazac B2'!$C$58,1,FALSE)),A325,\"\")","v":"8:2 Fluorotelomer sulfonska kiselina (8:2 FTS)"},1,{"$f":"IF(F325=0,\"\",COUNTIF($F$2:F325,\">0\"))","v":324},"8:2 Fluorotelomer sulfonska kiselina (8:2 FTS)"]