{"text_format":"1","workbook":"xlsx","n_sheets":12,"sheets":["Obrazac B2","Popis pokazatelja","AUTOHEIGHT","DATA_SHEET_TRAJ_UZORK","DATA_SHEET_NAC_ODR_PROT","META_DATA","DATA_SHEET_FREKV_UZORK","DATA_SHEET_VRSTA_OKNA","DATA_SHEET_VRSTE_PRIJAMNIKA","DATA_SHEET_VREMENSKI_UVJETI","DATA_SHEET_LABORATORIJI","DATA_SHEET_POKAZATELJI"],"not_rendered":{"charts":0,"images":0,"macros":1,"external_links":0,"defined_names":83,"comments":0,"pivot_tables":0},"unopened":[],"bounds":{"document_bytes":16777216,"sheet_cells":100000,"rows_first":2000,"rows_last":500,"rows_between":2000,"halvings":0,"cell_chars":16384,"cell_head_chars":4096},"cells_cut":0,"cells_raw":0,"read":"whole","date_system":"1900"}

{"sheet":"Obrazac B2","index":0,"n_rows":65,"n_cols":8,"rows_kept":65,"cut":false,"hidden":false,"merged":[[25,5,25,8],[24,5,24,8],[7,2,7,8],[7,0,7,1],[8,7,8,8],[11,7,11,8],[31,1,31,2],[34,1,34,4],[32,1,32,4],[32,5,32,8],[27,5,27,8],[27,1,27,4],[28,3,28,4],[28,1,28,2],[34,5,34,8],[33,1,33,4],[29,1,29,4],[30,1,30,4],[29,5,29,8],[30,5,30,8],[4,0,4,1],[3,2,3,8],[23,5,23,8],[10,0,10,1],[19,3,19,5],[20,3,20,5],[3,0,3,1],[15,6,17,6],[10,7,10,8],[13,3,13,5],[8,0,8,1],[13,1,13,2],[8,3,8,5],[9,3,9,5],[10,3,10,5],[5,3,5,5],[19,6,21,6],[15,3,15,5],[16,3,16,5],[22,0,22,8],[35,1,35,4],[46,2,46,3],[5,7,5,8],[64,6,64,8],[63,0,63,2],[63,6,63,8],[48,2,48,3],[51,2,51,3],[51,6,51,8],[55,2,55,3],[55,6,55,8],[62,6,62,8],[49,2,49,3],[64,0,64,2],[62,0,62,2],[48,6,48,8],[50,6,50,8],[49,6,49,8],[11,3,11,5],[26,1,26,4],[26,5,26,8],[28,6,28,7],[25,1,25,4],[24,1,24,4],[40,1,40,2],[38,5,38,8],[39,5,39,8],[40,3,40,4],[40,6,40,7],[38,1,38,4],[53,6,53,8],[43,2,43,3],[44,2,44,3],[45,2,45,3],[44,6,44,8],[43,6,43,8],[52,2,52,3],[53,2,53,3],[50,2,50,3],[52,6,52,8],[47,2,47,3],[45,6,45,8],[46,6,46,8],[47,6,47,8],[36,1,36,4],[37,1,37,4],[36,5,36,8],[37,5,37,8],[0,0,0,8],[62,3,62,5],[41,0,41,8],[42,6,42,8],[33,5,33,8],[59,0,60,8],[31,3,31,4],[31,6,31,7],[1,3,1,4],[4,3,4,5],[15,0,15,1],[23,1,23,4],[19,0,19,1],[20,0,20,1],[1,7,1,8],[4,7,4,8],[35,5,35,8],[39,1,39,4],[54,0,54,8],[42,2,42,3]]}
["Obrazac B2 - OČEVIDNIK ISPITIVANJA KOMPOZITNOG UZORKA"]
[null,null,"Naš broj:",null,null,null,"Datum:"]
[]
["Naziv onečišćivača:"]
["Adresa sjedišta:",null,"Ulica i kućni br.:",null,null,null,"OIB:"]
[null,null,"Naselje:",null,null,null,"MBPS (DZS):"]
[]
["Naziv lokacije onečišćivača:"]
["Adresa lokacije:",null,"Ulica i kućni br.:",null,null,null,"RBDPS (DZS):"]
[null,null,"Naselje:"]
["Kontakt osoba na lokaciji: ",null,"Ime i prezime:",null,null,null,"Tel:"]
[null,null,"e-mail:",null,null,null,"Mob:"]
[]
[null,"Vrsta prijamnika:"]
[]
["Podaci o ispustu:",null,"Naziv ispusta:",null,null,null,"Koordinate točke  ispuštanja (HTRS96/TM):","N    "]
[null,null,"Oznaka ispusta:",null,null,null,null,"E    "]
[]
[]
["Podaci o mjernom oknu:",null,"Vrsta mj. okna:",null,null,null,"Koordinate   mjernog okna (HTRS96/TM):","N    "]
[null,null,"ID mj. okna:",null,null,null,null,"E    "]
[]
["OPĆI PODACI "]
[1,"Podaci o laboratoriju koji je izvršio ispitivanje otpadne vode"]
[2,"Analitički broj izvješća o ispitivanju"]
[3,"Datum izvješća o ispitivanju (dd.mm.gggg)"]
[4,"Podaci o laboratoriju koji je izvršio uzorkovanje"]
[5,"Naziv i oznaka uzorka"]
[6,"Početak uzorkovanja ",null,"Datum  (dd.mm.gggg)",null,null,"Vrijeme (hh:min)"]
[7,"Trajanje uzorkovanja (h)"]
{"$rows_left_out":36}
{"sheet":"Popis pokazatelja","index":1,"n_rows":326,"n_cols":3,"rows_kept":326,"cut":false,"hidden":false,"merged":[]}
["Datum ispisa:",{"$f":"TODAY()","v":"2026-02-19"}]
["Šifra pokazatelja","Naziv pokazatelja","Mjerna jedinica"]
[{"$f":"_xlfn._xlws.SORT(\n    _xlfn._xlws.FILTER(\n        CHOOSE({1,2,3},\n            DATA_SHEET_POKAZATELJI!C2:C1000,\n            DATA_SHEET_POKAZATELJI!A2:A1000,\n            DATA_SHEET_POKAZATELJI!D2:D1000\n        ),\n        DATA_SHEET_POKAZATELJI!A2:A1000<>\"\"\n    ),\n    2,\n    1\n)","v":"ORG0001-0002"},"1,1,1-trikloretan","mg/l"]
["ORG0002-0001","1,1-dikloreten","mg/l"]
["ORG0003-0001","1,2,3,4,6,7,8,9-Oktaklordibenzodioksin (OCDD) ","ng/l"]
["ORG0004-0001","1,2,3,4,6,7,8,9-Oktaklordibenzofuran (OCDF) ","ng/l"]
["ORG0005-0001","1,2,3,4,6,7,8-Heptaklordibenzodioksin (HpCDD) ","ng/l"]
["ORG0006-0001","1,2,3,4,6,7,8-Heptaklordibenzofuran (HpCDF) ","ng/l"]
["ORG0007-0001","1,2,3,4,7,8,9-Heptaklordibenzofuran (HpCDF) ","ng/l"]
["ORG0008-0001","1,2,3,4,7,8-Heksaklordibenzodioksin (HxCDD)","ng/l"]
["ORG0009-0001","1,2,3,4,7,8-Heksaklordibenzofuran (HxCDF) ","ng/l"]
["ORG0010-0001","1,2,3,6,7,8-Heksaklordibenzodioksin (HxCDD) ","ng/l"]
["ORG0011-0001","1,2,3,6,7,8-Heksaklordibenzofuran (HxCDF) ","ng/l"]
["ORG0012-0001","1,2,3,7,8,9-Heksaklordibenzodioksin (HxCDD)","ng/l"]
["ORG0013-0001","1,2,3,7,8,9-Heksaklordibenzofuran (HxCDF) ","ng/l"]
["ORG0014-0001","1,2,3,7,8-Pentaklordibenzodioksin (PeCDD)","ng/l"]
["ORG0015-0001","1,2,3,7,8-Pentaklordibenzofuran (PeCDF)","ng/l"]
["ORG0016-0002","1,2,3-triklorbenzen","mg/l"]
["ORG0017-0002","1,2,4-triklorbenzen","mg/l"]
["ORG0018-0002","1,2,5,6,9,10-heksabromociklododekan","mg/l"]
["ORG0019-0002","1,2-dikloretan","mg/l"]
["ORG0020-0002","1,3,5,7,9,11-heksabromociklododekan ","mg/l"]
["ORG0021-0002","1,3,5-triklorbenzen","mg/l"]
["ORG0022-0001","2,3,4,6,7,8-Heksaklordibenzofuran (HxCDF) ","ng/l"]
["ORG0023-0001","2,3,4,7,8-Pentaklordibenzofuran (PeCDF) ","ng/l"]
["ORG0024-0001","2,3,7,8-Tetraklordibenzodioksin (TCDD)","ng/l"]
["ORG0025-0001","2,3,7,8-Tetraklordibenzofuran (TCDF)","ng/l"]
["ORG0417-0001","2,4' DDD","mg/l"]
["ORG0418-0001","2,4' DDE","mg/l"]
["ORG0026-0002","2,4' DDT","mg/l"]
{"$rows_left_out":297}
{"sheet":"AUTOHEIGHT","index":2,"n_rows":0,"n_cols":0,"rows_kept":0,"cut":false,"hidden":true,"merged":[]}

{"sheet":"DATA_SHEET_TRAJ_UZORK","index":3,"n_rows":7,"n_cols":2,"rows_kept":7,"cut":false,"hidden":true,"merged":[]}
["Vrijeme","IDPeriodUzorkovanja"]
[4,4]
[6,5]
[8,6]
[12,7]
[16,8]
[24,9]

{"sheet":"DATA_SHEET_NAC_ODR_PROT","index":4,"n_rows":3,"n_cols":2,"rows_kept":3,"cut":false,"hidden":true,"merged":[]}
["Naziv","IDNacinOdredivanjaProtoka"]
["Ugrađeni mjerni uređaj",1]
["Uređaj laboratorija",2]

{"sheet":"META_DATA","index":5,"n_rows":12,"n_cols":2,"rows_kept":12,"cut":false,"hidden":true,"merged":[]}
["TYPE","B2"]
["VERSION","2.2"]
["DATE","19.02.2026."]
["DESCRIPTION","1.0: Inicijalna verzija\n1.1: Dorade za specifikaciju v5.0\n1.2: BugFixes \n1.3: BugFixes\n1.4: Dodani pokazatelji \n1.6 Azuriranje naziva laboratorija zavoda Osijek\n1.7 dodani pokazatelji\n1.8 dodan laboratorij ZAVOD ZA JAVNO ZDRAVSTVO ZAGREBAČKE ŽUPANIJE\n1.9 dodan pokazatelj FKP0030-0001FKP0030-0001\n2.1 dodani pokazatelji, dodan sheet Popis pokazatelja\n2.2 promjenjen naziv laboratorija Istra, dodan novi laboratorij"]
["DATA_SHEET_VREMENSKI_UVJETI","exec [ZastitaVoda].[VrijemenskiUvjetiGetForOtpadneVode]"]
["DATA_SHEET_LABORATORIJI","select lab.NazivLaboratorijaOtpadneVode, lab.IDLaboratorij, nas.Naziv as Naselje, adr.Ulica from ZastitaVoda.Laboratorij as lab inner join Adresa.Adresa as adr on lab.AdresaID = adr.IDAdresa inner join Adresa.Naselje as nas on adr.NaseljeID = nas.IDNaselje where ObrasciB1iB2 = 1"]
["DATA_SHEET_POKAZATELJI","SELECT pok.Naziv , pok.IDPokazatelj , pok.Sifra , mj.Naziv as MjJed FROM Pokazatelj.PokazateljModul AS modul INNER JOIN Pokazatelj.Pokazatelj AS pok ON modul.PokazateljID = pok.IDPokazatelj INNER JOIN Pokazatelj.MjernaJedinica AS mj ON pok.MjernaJedinicaID = mj.IDMjernaJedinica WHERE modul.ModulID = 3 AND NOT pok.Sifra IN ('FKP0003-0001','REK0001-0001','REK0002-0001','FKP0005-0001','FKP0006-0001','REK0004-0002' ,'FKP0011-0001','ION0015-0002','FKP0018-0002','FKP0020-0001','FKP0022-0001','FKP0023-0001','FKP0013-0001')"]
["DATA_SHEET_VRSTE_PRIJAMNIKA","SELECT Naziv, IDVrstaPrijemnika FROM ZastitaVoda.VrstaPrijemnika"]
["DATA_SHEET_VRSTA_OKNA","SELECT Naziv, IDVrstaOkna FROM ZastitaVoda.VrstaOkna WHERE Naziv LIKE '%kakvoća%'"]
["DATA_SHEET_NAC_ODR_PROT","select Naziv, IDNacinOdredivanjaProtoka from ZastitaVoda.NacinOdredivanjaProtoka"]
["DATA_SHEET_FREKV_UZORK","select Vrijeme, IDPeriodUzorkovanja from ZastitaVoda.PeriodUzorkovanja where VremenskiTipUzorkovanjaID = 1"]
["DATA_SHEET_TRAJ_UZORK","select Vrijeme, IDPeriodUzorkovanja from ZastitaVoda.PeriodUzorkovanja where VremenskiTipUzorkovanjaID = 2"]

{"sheet":"DATA_SHEET_FREKV_UZORK","index":6,"n_rows":4,"n_cols":2,"rows_kept":4,"cut":false,"hidden":true,"merged":[]}
["Vrijeme","IDPeriodUzorkovanja"]
[0.5,1]
[1,2]
[2,3]

{"sheet":"DATA_SHEET_VRSTA_OKNA","index":7,"n_rows":3,"n_cols":2,"rows_kept":3,"cut":false,"hidden":true,"merged":[]}
["Naziv","IDVrstaOkna"]
["Ulaz - kakvoća",2]
["Izlaz - kakvoća",4]

{"sheet":"DATA_SHEET_VRSTE_PRIJAMNIKA","index":8,"n_rows":4,"n_cols":2,"rows_kept":4,"cut":false,"hidden":true,"merged":[]}
["Naziv","IDVrstaPrijemnika"]
["Prirodni prijemnik",1]
["Sustav javne odvodnje",2]
["Sustav JO - pražnjenje sabirne jame",3]

{"sheet":"DATA_SHEET_VREMENSKI_UVJETI","index":9,"n_rows":5,"n_cols":2,"rows_kept":5,"cut":false,"hidden":true,"merged":[]}
["Naziv","ID"]
["Slaba kiša",10]
["Umjerena kiša",11]
["Jaka kiša",12]
["Bez oborina",13]

{"sheet":"DATA_SHEET_LABORATORIJI","index":10,"n_rows":50,"n_cols":7,"rows_kept":50,"cut":false,"hidden":true,"merged":[]}
["NazivLaboratorijaOtpadneVode","IDLaboratorij","Naselje","Ulica","SEARCH","FREQUENCY","FINAL LIST"]
["Zavod za javno zdravstvo Karlovačke županije",2,"Karlovac","Dr. V. Mačeka 48",{"$f":"IFERROR(SEARCH(INDIRECT(CELL(\"address\")),A2),0)","v":1},{"$f":"IF(E2=0,\"\",COUNTIF($E$2:E2,\">0\"))","v":1},{"$f":"IFERROR(INDEX(A:A,MATCH(ROW(E1),F:F,0)),\"\")","v":"Zavod za javno zdravstvo Karlovačke županije"}]
["ZAVOD ZA JAVNO ZDRAVSTVO Krapinsko-zagorske županije",3,"Zlatar","Ivana Gorana Kovačića 1",{"$f":"IFERROR(SEARCH(INDIRECT(CELL(\"address\")),A3),0)","v":1},{"$f":"IF(E3=0,\"\",COUNTIF($E$2:E3,\">0\"))","v":2},{"$f":"IFERROR(INDEX(A:A,MATCH(ROW(E2),F:F,0)),\"\")","v":"ZAVOD ZA JAVNO ZDRAVSTVO Krapinsko-zagorske županije"}]
["Nastavni zavod za javno zdravstvo dr. Andrija Štampar",4,"Zagreb","Mirogojska cesta 16",1,{"$f":"IF(E4=0,\"\",COUNTIF($E$2:E4,\">0\"))","v":3},"Nastavni zavod za javno zdravstvo dr. Andrija Štampar"]
["Zavod za javno zdravstvo Sisačko-moslavačke županije",5,"Sisak","Kralja Tomislava 1",1,{"$f":"IF(E5=0,\"\",COUNTIF($E$2:E5,\">0\"))","v":4},"Zavod za javno zdravstvo Sisačko-moslavačke županije"]
["Sveučilište u Zagrebu, Medicinski fakultet, Škola narodnog zdravlja \"Andrija Štampar\"",8,"Zagreb","Rockefellerova 4",1,{"$f":"IF(E6=0,\"\",COUNTIF($E$2:E6,\">0\"))","v":5},"Sveučilište u Zagrebu, Medicinski fakultet, Škola narodnog zdravlja \"Andrija Štampar\""]
["BIOINSTITUT d.o.o. ",9,"Čakovec","dr. Rudolfa Steinera 7",1,{"$f":"IF(E7=0,\"\",COUNTIF($E$2:E7,\">0\"))","v":6},"BIOINSTITUT d.o.o. "]
["Zavod za javno zdravstvo Koprivničko-križevačke županije",10,"Koprivnica","Trg Tomislava dr. Bardeka 10/10",1,{"$f":"IF(E8=0,\"\",COUNTIF($E$2:E8,\">0\"))","v":7},"Zavod za javno zdravstvo Koprivničko-križevačke županije"]
["Nastavni zavod za javno zdravstvo Osječko - baranjske županije",11,"Osijek","Drinska 8",1,{"$f":"IF(E9=0,\"\",COUNTIF($E$2:E9,\">0\"))","v":8},"Nastavni zavod za javno zdravstvo Osječko - baranjske županije"]
["Zavod za javno zdravstvo Varaždinske županije",12,"Varaždin","Meštrovićeva ulica 1/11",1,{"$f":"IF(E10=0,\"\",COUNTIF($E$2:E10,\">0\"))","v":9},"Zavod za javno zdravstvo Varaždinske županije"]
["Nastavni zavod za javno zdravstvo Istarske županije - Istituto formativo di sanita pubblica della regione Istriana",13,"Pula","Nazorova ulica 23",1,{"$f":"IF(E11=0,\"\",COUNTIF($E$2:E11,\">0\"))","v":10},"Nastavni zavod za javno zdravstvo Istarske županije - Istituto formativo di sanita pubblica della regione Istriana"]
["Nastavni zavod za javno zdravstvo Primorsko - goranske županije",14,"Rijeka","Krešimirova ulica 52a",1,{"$f":"IF(E12=0,\"\",COUNTIF($E$2:E12,\">0\"))","v":11},"Nastavni zavod za javno zdravstvo Primorsko - goranske županije"]
["Nastavni zavod za javno zdravstvo Splitsko-dalmatinske županije",16,"Split","Vukovarska ulica 46",1,{"$f":"IF(E13=0,\"\",COUNTIF($E$2:E13,\">0\"))","v":12},"Nastavni zavod za javno zdravstvo Splitsko-dalmatinske županije"]
["Zavod za javno zdravstvo Zadar",17,"Zadar","Kolovare 2",1,{"$f":"IF(E14=0,\"\",COUNTIF($E$2:E14,\">0\"))","v":13},"Zavod za javno zdravstvo Zadar"]
["Zavod za javno zdravstvo Ličko-senjske županije",19,"Gospić","Senjskih žrtava 2",1,{"$f":"IF(E15=0,\"\",COUNTIF($E$2:E15,\">0\"))","v":14},"Zavod za javno zdravstvo Ličko-senjske županije"]
["Hrvatski zavod za javno zdravstvo",20,"Zagreb","Rockefellerova 7",1,{"$f":"IF(E16=0,\"\",COUNTIF($E$2:E16,\">0\"))","v":15},"Hrvatski zavod za javno zdravstvo"]
["Vodoopskrba i odvodnja d.o.o., Laboratorij tehnološke službe odvodnje (LTSO)",116,"Zagreb","Folnegovićeva ulica 1",1,{"$f":"IF(E17=0,\"\",COUNTIF($E$2:E17,\">0\"))","v":16},"Vodoopskrba i odvodnja d.o.o., Laboratorij tehnološke službe odvodnje (LTSO)"]
["Cemtra d.o.o.",119,"Zagreb","Vlaška 67",1,{"$f":"IF(E18=0,\"\",COUNTIF($E$2:E18,\">0\"))","v":17},"Cemtra d.o.o."]
["E.C. Inspekt d.o.o.",122,"Zagreb","Pupačićeva 2",1,{"$f":"IF(E19=0,\"\",COUNTIF($E$2:E19,\">0\"))","v":18},"E.C. Inspekt d.o.o."]
["Vodovod-Osijek d.o.o.",124,"Osijek","Poljski put 1",1,{"$f":"IF(E20=0,\"\",COUNTIF($E$2:E20,\">0\"))","v":19},"Vodovod-Osijek d.o.o."]
["EUROINSPEKT-TEHNOKEM d.o.o. ",125,"Zagreb","Ivekovićeve stube 9",1,{"$f":"IF(E21=0,\"\",COUNTIF($E$2:E21,\">0\"))","v":20},"EUROINSPEKT-TEHNOKEM d.o.o. "]
["EUROFINS CROATIAKONTROLA d.o.o.",126,"Zagreb","Karlovačka cesta 4L",1,{"$f":"IF(E22=0,\"\",COUNTIF($E$2:E22,\">0\"))","v":21},"EUROFINS CROATIAKONTROLA d.o.o."]
["HIDRO.LAB. d.o.o.",127,"Ičići","Kolavići 5",1,{"$f":"IF(E23=0,\"\",COUNTIF($E$2:E23,\">0\"))","v":22},"HIDRO.LAB. d.o.o."]
["INA-Industrija nafte d.d., Centralni ispitni laboratorij",131,"Zagreb","Lovinčićeva 4",1,{"$f":"IF(E24=0,\"\",COUNTIF($E$2:E24,\">0\"))","v":23},"INA-Industrija nafte d.d., Centralni ispitni laboratorij"]
["PETROKEMIJA, d.d. tvornica gnojiva ",142,"Kutina","Aleja Vukovara 4",1,{"$f":"IF(E25=0,\"\",COUNTIF($E$2:E25,\">0\"))","v":24},"PETROKEMIJA, d.d. tvornica gnojiva "]
["HRVATSKI VETERINARSKI INSTITUT, Podružnica Veterinarski zavod Križevci",148,"Križevci","Zakmardijeva 10",1,{"$f":"IF(E26=0,\"\",COUNTIF($E$2:E26,\">0\"))","v":25},"HRVATSKI VETERINARSKI INSTITUT, Podružnica Veterinarski zavod Križevci"]
["HRVATSKI VETERINARSKI INSTITUT, Podružnica Veterinarski zavod Vinkovci",149,"Vinkovci","J. Kozarca 24",1,{"$f":"IF(E27=0,\"\",COUNTIF($E$2:E27,\">0\"))","v":26},"HRVATSKI VETERINARSKI INSTITUT, Podružnica Veterinarski zavod Vinkovci"]
["Zagrebačke otpadne vode - upravljanje i pogon d.o.o.",153,"Zagreb","Čulinečka cesta 287",1,{"$f":"IF(E28=0,\"\",COUNTIF($E$2:E28,\">0\"))","v":27},"Zagrebačke otpadne vode - upravljanje i pogon d.o.o."]
["Zavod za javno zdravstvo Bjelovarsko-bilogorske županije ",155,"Bjelovar","Matice hrvatske 15",1,{"$f":"IF(E29=0,\"\",COUNTIF($E$2:E29,\">0\"))","v":28},"Zavod za javno zdravstvo Bjelovarsko-bilogorske županije "]
["Nastavni zavod za javno zdravstvo Brodsko-posavske županije ",156,"Slavonski Brod","Vladimira Nazora 2a",1,{"$f":"IF(E30=0,\"\",COUNTIF($E$2:E30,\">0\"))","v":29},"Nastavni zavod za javno zdravstvo Brodsko-posavske županije "]
{"$rows_left_out":21}
{"sheet":"DATA_SHEET_POKAZATELJI","index":11,"n_rows":325,"n_cols":8,"rows_kept":325,"cut":false,"hidden":true,"merged":[]}
["Naziv","IDPokazatelj","Sifra","MjJed","UNIQUE","SEARCH","FREQUENCY","FINAL LIST"]
["1,1,1-trikloretan",2,"ORG0001-0002","mg/l",{"$f":"IF(ISERROR(VLOOKUP(A2,'Obrazac B2'!$C$55:'Obrazac B2'!$C$58,1,FALSE)),A2,\"\")","v":"1,1,1-trikloretan"},{"$f":"IFERROR(SEARCH(INDIRECT(CELL(\"address\")),E2),0)","v":1},{"$f":"IF(F2=0,\"\",COUNTIF($F$2:F2,\">0\"))","v":1},{"$f":"IFERROR(INDEX(E:E,MATCH(ROW(F1),G:G,0)),\"\")","v":"1,1,1-trikloretan"}]
["1,1-dikloreten",4,"ORG0002-0001","mg/l",{"$f":"IF(ISERROR(VLOOKUP(A3,'Obrazac B2'!$C$55:'Obrazac B2'!$C$58,1,FALSE)),A3,\"\")","v":"1,1-dikloreten"},{"$f":"IFERROR(SEARCH(INDIRECT(CELL(\"address\")),E3),0)","v":1},{"$f":"IF(F3=0,\"\",COUNTIF($F$2:F3,\">0\"))","v":2},"1,1-dikloreten"]
["1,2,3,4,6,7,8,9-Oktaklordibenzodioksin (OCDD) ",5,"ORG0003-0001","ng/l",{"$f":"IF(ISERROR(VLOOKUP(A4,'Obrazac B2'!$C$55:'Obrazac B2'!$C$58,1,FALSE)),A4,\"\")","v":"1,2,3,4,6,7,8,9-Oktaklordibenzodioksin (OCDD) "},1,{"$f":"IF(F4=0,\"\",COUNTIF($F$2:F4,\">0\"))","v":3},"1,2,3,4,6,7,8,9-Oktaklordibenzodioksin (OCDD) "]
["1,2,3,4,6,7,8,9-Oktaklordibenzofuran (OCDF) ",8,"ORG0004-0001","ng/l",{"$f":"IF(ISERROR(VLOOKUP(A5,'Obrazac B2'!$C$55:'Obrazac B2'!$C$58,1,FALSE)),A5,\"\")","v":"1,2,3,4,6,7,8,9-Oktaklordibenzofuran (OCDF) "},1,{"$f":"IF(F5=0,\"\",COUNTIF($F$2:F5,\">0\"))","v":4},"1,2,3,4,6,7,8,9-Oktaklordibenzofuran (OCDF) "]
["1,2,3,4,6,7,8-Heptaklordibenzodioksin (HpCDD) ",11,"ORG0005-0001","ng/l",{"$f":"IF(ISERROR(VLOOKUP(A6,'Obrazac B2'!$C$55:'Obrazac B2'!$C$58,1,FALSE)),A6,\"\")","v":"1,2,3,4,6,7,8-Heptaklordibenzodioksin (HpCDD) "},1,{"$f":"IF(F6=0,\"\",COUNTIF($F$2:F6,\">0\"))","v":5},"1,2,3,4,6,7,8-Heptaklordibenzodioksin (HpCDD) "]
["1,2,3,4,6,7,8-Heptaklordibenzofuran (HpCDF) ",14,"ORG0006-0001","ng/l",{"$f":"IF(ISERROR(VLOOKUP(A7,'Obrazac B2'!$C$55:'Obrazac B2'!$C$58,1,FALSE)),A7,\"\")","v":"1,2,3,4,6,7,8-Heptaklordibenzofuran (HpCDF) "},1,{"$f":"IF(F7=0,\"\",COUNTIF($F$2:F7,\">0\"))","v":6},"1,2,3,4,6,7,8-Heptaklordibenzofuran (HpCDF) "]
["1,2,3,4,7,8,9-Heptaklordibenzofuran (HpCDF) ",17,"ORG0007-0001","ng/l",{"$f":"IF(ISERROR(VLOOKUP(A8,'Obrazac B2'!$C$55:'Obrazac B2'!$C$58,1,FALSE)),A8,\"\")","v":"1,2,3,4,7,8,9-Heptaklordibenzofuran (HpCDF) "},1,{"$f":"IF(F8=0,\"\",COUNTIF($F$2:F8,\">0\"))","v":7},"1,2,3,4,7,8,9-Heptaklordibenzofuran (HpCDF) "]
["1,2,3,4,7,8-Heksaklordibenzodioksin (HxCDD)",20,"ORG0008-0001","ng/l",{"$f":"IF(ISERROR(VLOOKUP(A9,'Obrazac B2'!$C$55:'Obrazac B2'!$C$58,1,FALSE)),A9,\"\")","v":"1,2,3,4,7,8-Heksaklordibenzodioksin (HxCDD)"},1,{"$f":"IF(F9=0,\"\",COUNTIF($F$2:F9,\">0\"))","v":8},"1,2,3,4,7,8-Heksaklordibenzodioksin (HxCDD)"]
["1,2,3,4,7,8-Heksaklordibenzofuran (HxCDF) ",23,"ORG0009-0001","ng/l",{"$f":"IF(ISERROR(VLOOKUP(A10,'Obrazac B2'!$C$55:'Obrazac B2'!$C$58,1,FALSE)),A10,\"\")","v":"1,2,3,4,7,8-Heksaklordibenzofuran (HxCDF) "},1,{"$f":"IF(F10=0,\"\",COUNTIF($F$2:F10,\">0\"))","v":9},"1,2,3,4,7,8-Heksaklordibenzofuran (HxCDF) "]
["1,2,3,6,7,8-Heksaklordibenzodioksin (HxCDD) ",26,"ORG0010-0001","ng/l",{"$f":"IF(ISERROR(VLOOKUP(A11,'Obrazac B2'!$C$55:'Obrazac B2'!$C$58,1,FALSE)),A11,\"\")","v":"1,2,3,6,7,8-Heksaklordibenzodioksin (HxCDD) "},1,{"$f":"IF(F11=0,\"\",COUNTIF($F$2:F11,\">0\"))","v":10},"1,2,3,6,7,8-Heksaklordibenzodioksin (HxCDD) "]
["1,2,3,6,7,8-Heksaklordibenzofuran (HxCDF) ",29,"ORG0011-0001","ng/l",{"$f":"IF(ISERROR(VLOOKUP(A12,'Obrazac B2'!$C$55:'Obrazac B2'!$C$58,1,FALSE)),A12,\"\")","v":"1,2,3,6,7,8-Heksaklordibenzofuran (HxCDF) "},1,{"$f":"IF(F12=0,\"\",COUNTIF($F$2:F12,\">0\"))","v":11},"1,2,3,6,7,8-Heksaklordibenzofuran (HxCDF) "]
["1,2,3,7,8,9-Heksaklordibenzodioksin (HxCDD)",32,"ORG0012-0001","ng/l",{"$f":"IF(ISERROR(VLOOKUP(A13,'Obrazac B2'!$C$55:'Obrazac B2'!$C$58,1,FALSE)),A13,\"\")","v":"1,2,3,7,8,9-Heksaklordibenzodioksin (HxCDD)"},1,{"$f":"IF(F13=0,\"\",COUNTIF($F$2:F13,\">0\"))","v":12},"1,2,3,7,8,9-Heksaklordibenzodioksin (HxCDD)"]
["1,2,3,7,8,9-Heksaklordibenzofuran (HxCDF) ",35,"ORG0013-0001","ng/l",{"$f":"IF(ISERROR(VLOOKUP(A14,'Obrazac B2'!$C$55:'Obrazac B2'!$C$58,1,FALSE)),A14,\"\")","v":"1,2,3,7,8,9-Heksaklordibenzofuran (HxCDF) "},1,{"$f":"IF(F14=0,\"\",COUNTIF($F$2:F14,\">0\"))","v":13},"1,2,3,7,8,9-Heksaklordibenzofuran (HxCDF) "]
["1,2,3,7,8-Pentaklordibenzodioksin (PeCDD)",38,"ORG0014-0001","ng/l",{"$f":"IF(ISERROR(VLOOKUP(A15,'Obrazac B2'!$C$55:'Obrazac B2'!$C$58,1,FALSE)),A15,\"\")","v":"1,2,3,7,8-Pentaklordibenzodioksin (PeCDD)"},1,{"$f":"IF(F15=0,\"\",COUNTIF($F$2:F15,\">0\"))","v":14},"1,2,3,7,8-Pentaklordibenzodioksin (PeCDD)"]
["1,2,3,7,8-Pentaklordibenzofuran (PeCDF)",41,"ORG0015-0001","ng/l",{"$f":"IF(ISERROR(VLOOKUP(A16,'Obrazac B2'!$C$55:'Obrazac B2'!$C$58,1,FALSE)),A16,\"\")","v":"1,2,3,7,8-Pentaklordibenzofuran (PeCDF)"},1,{"$f":"IF(F16=0,\"\",COUNTIF($F$2:F16,\">0\"))","v":15},"1,2,3,7,8-Pentaklordibenzofuran (PeCDF)"]
["1,2,3-triklorbenzen",45,"ORG0016-0002","mg/l",{"$f":"IF(ISERROR(VLOOKUP(A17,'Obrazac B2'!$C$55:'Obrazac B2'!$C$58,1,FALSE)),A17,\"\")","v":"1,2,3-triklorbenzen"},1,{"$f":"IF(F17=0,\"\",COUNTIF($F$2:F17,\">0\"))","v":16},"1,2,3-triklorbenzen"]
["1,2,4-triklorbenzen",48,"ORG0017-0002","mg/l",{"$f":"IF(ISERROR(VLOOKUP(A18,'Obrazac B2'!$C$55:'Obrazac B2'!$C$58,1,FALSE)),A18,\"\")","v":"1,2,4-triklorbenzen"},1,{"$f":"IF(F18=0,\"\",COUNTIF($F$2:F18,\">0\"))","v":17},"1,2,4-triklorbenzen"]
["1,2,5,6,9,10-heksabromociklododekan",51,"ORG0018-0002","mg/l",{"$f":"IF(ISERROR(VLOOKUP(A19,'Obrazac B2'!$C$55:'Obrazac B2'!$C$58,1,FALSE)),A19,\"\")","v":"1,2,5,6,9,10-heksabromociklododekan"},1,{"$f":"IF(F19=0,\"\",COUNTIF($F$2:F19,\">0\"))","v":18},"1,2,5,6,9,10-heksabromociklododekan"]
["1,2-dikloretan",54,"ORG0019-0002","mg/l",{"$f":"IF(ISERROR(VLOOKUP(A20,'Obrazac B2'!$C$55:'Obrazac B2'!$C$58,1,FALSE)),A20,\"\")","v":"1,2-dikloretan"},1,{"$f":"IF(F20=0,\"\",COUNTIF($F$2:F20,\">0\"))","v":19},"1,2-dikloretan"]
["1,3,5,7,9,11-heksabromociklododekan ",57,"ORG0020-0002","mg/l",{"$f":"IF(ISERROR(VLOOKUP(A21,'Obrazac B2'!$C$55:'Obrazac B2'!$C$58,1,FALSE)),A21,\"\")","v":"1,3,5,7,9,11-heksabromociklododekan "},1,{"$f":"IF(F21=0,\"\",COUNTIF($F$2:F21,\">0\"))","v":20},"1,3,5,7,9,11-heksabromociklododekan "]
["1,3,5-triklorbenzen",60,"ORG0021-0002","mg/l",{"$f":"IF(ISERROR(VLOOKUP(A22,'Obrazac B2'!$C$55:'Obrazac B2'!$C$58,1,FALSE)),A22,\"\")","v":"1,3,5-triklorbenzen"},1,{"$f":"IF(F22=0,\"\",COUNTIF($F$2:F22,\">0\"))","v":21},"1,3,5-triklorbenzen"]
["2,3,4,6,7,8-Heksaklordibenzofuran (HxCDF) ",62,"ORG0022-0001","ng/l",{"$f":"IF(ISERROR(VLOOKUP(A23,'Obrazac B2'!$C$55:'Obrazac B2'!$C$58,1,FALSE)),A23,\"\")","v":"2,3,4,6,7,8-Heksaklordibenzofuran (HxCDF) "},1,{"$f":"IF(F23=0,\"\",COUNTIF($F$2:F23,\">0\"))","v":22},"2,3,4,6,7,8-Heksaklordibenzofuran (HxCDF) "]
["2,3,4,7,8-Pentaklordibenzofuran (PeCDF) ",65,"ORG0023-0001","ng/l",{"$f":"IF(ISERROR(VLOOKUP(A24,'Obrazac B2'!$C$55:'Obrazac B2'!$C$58,1,FALSE)),A24,\"\")","v":"2,3,4,7,8-Pentaklordibenzofuran (PeCDF) "},1,{"$f":"IF(F24=0,\"\",COUNTIF($F$2:F24,\">0\"))","v":23},"2,3,4,7,8-Pentaklordibenzofuran (PeCDF) "]
["2,3,7,8-Tetraklordibenzodioksin (TCDD)",68,"ORG0024-0001","ng/l",{"$f":"IF(ISERROR(VLOOKUP(A25,'Obrazac B2'!$C$55:'Obrazac B2'!$C$58,1,FALSE)),A25,\"\")","v":"2,3,7,8-Tetraklordibenzodioksin (TCDD)"},1,{"$f":"IF(F25=0,\"\",COUNTIF($F$2:F25,\">0\"))","v":24},"2,3,7,8-Tetraklordibenzodioksin (TCDD)"]
["2,3,7,8-Tetraklordibenzofuran (TCDF)",71,"ORG0025-0001","ng/l",{"$f":"IF(ISERROR(VLOOKUP(A26,'Obrazac B2'!$C$55:'Obrazac B2'!$C$58,1,FALSE)),A26,\"\")","v":"2,3,7,8-Tetraklordibenzofuran (TCDF)"},1,{"$f":"IF(F26=0,\"\",COUNTIF($F$2:F26,\">0\"))","v":25},"2,3,7,8-Tetraklordibenzofuran (TCDF)"]
["2,4' DDT",75,"ORG0026-0002","mg/l",{"$f":"IF(ISERROR(VLOOKUP(A27,'Obrazac B2'!$C$55:'Obrazac B2'!$C$58,1,FALSE)),A27,\"\")","v":"2,4' DDT"},1,{"$f":"IF(F27=0,\"\",COUNTIF($F$2:F27,\">0\"))","v":26},"2,4' DDT"]
["4,4' DDD",85,"ORG0032-0002","mg/l",{"$f":"IF(ISERROR(VLOOKUP(A28,'Obrazac B2'!$C$55:'Obrazac B2'!$C$58,1,FALSE)),A28,\"\")","v":"4,4' DDD"},1,{"$f":"IF(F28=0,\"\",COUNTIF($F$2:F28,\">0\"))","v":27},"4,4' DDD"]
["4,4' DDE",88,"ORG0033-0002","mg/l",{"$f":"IF(ISERROR(VLOOKUP(A29,'Obrazac B2'!$C$55:'Obrazac B2'!$C$58,1,FALSE)),A29,\"\")","v":"4,4' DDE"},1,{"$f":"IF(F29=0,\"\",COUNTIF($F$2:F29,\">0\"))","v":28},"4,4' DDE"]
["4,4' DDT",91,"ORG0034-0002","mg/l",{"$f":"IF(ISERROR(VLOOKUP(A30,'Obrazac B2'!$C$55:'Obrazac B2'!$C$58,1,FALSE)),A30,\"\")","v":"4,4' DDT"},1,{"$f":"IF(F30=0,\"\",COUNTIF($F$2:F30,\">0\"))","v":29},"4,4' DDT"]
{"$rows_left_out":295}